All pastes #214598 Raw Edit

Anonymous

public text v1 · immutable
#214598 ·published 2006-10-22 02:58 UTC
rendered paste body
compile:
    [mkdir] Created dir: /home/trunk/classes
    [mkdir] Created dir: /home/trunk/src-archive
     [echo] Compiling 1.4 compatible slave files
    [javac] Compiling 54 source files to /home/trunk/classes
    [javac] /home/trunk/src/org/drftpd/ActiveConnection.java:30: error: Class or                                                                               interface `javax.net.ssl.SSLSocket' not found in import.
    [javac]    import javax.net.ssl.SSLSocket;
    [javac]           ^
    [javac] /home/trunk/src/org/drftpd/ActiveConnection.java:39: error: Type `SS                                                                              LContext' not found in declaration of field `_ctx'.
    [javac]        private SSLContext _ctx;
    [javac]                ^
    [javac] /home/trunk/src/org/drftpd/ActiveConnection.java:44: error: Type `SS                                                                              LContext' not found in the declaration of the argument `ctx' of method `<init>'.
    [javac]        public ActiveConnection(SSLContext ctx, InetSocketAddress add                                                                              r,
    [javac]                                ^
    [javac] /home/trunk/src/org/drftpd/ActiveConnection.java:56: error: Type `SS                                                                              LSocket' not found in the declaration of the local variable `sslsock'.
    [javac]                SSLSocket sslsock;
    [javac]                ^
    [javac] /home/trunk/src/org/drftpd/PassiveConnection.java:27: error: Class o                                                                              r interface `javax.net.ssl.SSLSocket' not found in import.
    [javac]    import javax.net.ssl.SSLSocket;
    [javac]           ^
    [javac] /home/trunk/src/org/drftpd/PassiveConnection.java:52: error: Type `S                                                                              SLContext' not found in the declaration of the argument `ctx' of method `<init>'                                                                              .
    [javac]        public PassiveConnection(SSLContext ctx, PortRange portRange,                                                                              boolean useSSLClientMode)
    [javac]                                 ^
    [javac] /home/trunk/src/org/drftpd/PassiveConnection.java:78: error: Type `S                                                                              SLSocket' not found in the declaration of the local variable `sslsock'.
    [javac]             SSLSocket sslsock = (SSLSocket) sock;
    [javac]                    ^
    [javac] /home/trunk/src/org/drftpd/SSLGetContext.java:29: error: Class or in                                                                              terface `javax.net.ssl.X509TrustManager' not found in import.
    [javac]    import javax.net.ssl.X509TrustManager;
    [javac]           ^
    [javac] /home/trunk/src/org/drftpd/SSLGetContext.java:37: error: Type `SSLCo                                                                              ntext' not found in declaration of field `ctx'.
    [javac]     static SSLContext ctx = null;
    [javac]                   ^
    [javac] /home/trunk/src/org/drftpd/SSLGetContext.java:38: error: Type `SSLCo                                                                              ntext' not found in the declaration of the return type of method `getSSLContext'                                                                              .
    [javac]        public static SSLContext getSSLContext()
    [javac]                      ^
    [javac] /home/trunk/src/org/drftpd/SSLGetContext.java:41: error: Type `Trust                                                                              Manager' not found in the declaration of the local variable `trustAllCerts'.
    [javac]            TrustManager[] trustAllCerts = new TrustManager[]{
    [javac]            ^
    [javac] /home/trunk/src/org/drftpd/SSLGetContext.java:59: error: Type `KeyMa                                                                              nagerFactory' not found in the declaration of the local variable `kmf'.
    [javac]            KeyManagerFactory kmf = KeyManagerFactory.getInstance("Su                                                                              nX509");
    [javac]            ^
    [javac] /home/trunk/src/org/drftpd/slave/Slave.java:47: error: Class or inte                                                                              rface `javax.net.ssl.SSLSocket' not found in import.
    [javac]    import javax.net.ssl.SSLSocket;
    [javac]           ^
    [javac] /home/trunk/src/org/drftpd/slave/Slave.java:97: error: Type `SSLCont                                                                              ext' not found in declaration of field `_ctx'.
    [javac]        private SSLContext _ctx;
    [javac]                ^
    [javac] /home/trunk/src/net/sf/drftpd/util/PortRange.java:28: error: Class o                                                                              r interface `javax.net.ServerSocketFactory' not found in import.
    [javac]    import javax.net.ServerSocketFactory;
    [javac]           ^
    [javac] /home/trunk/src/net/sf/drftpd/util/PortRange.java:58: error: Type `S                                                                              erverSocketFactory' not found in the declaration of the argument `ssf' of method                                                                               `getPort'.
    [javac]        public ServerSocket getPort(ServerSocketFactory ssf) {
    [javac]                                    ^
    [javac] 16 errors

BUILD FAILED
file:/home/trunk/build.xml:139: Compile failed; see the compiler error output fo                                                                              r details.