bs_gseen.c:210: error: static declaration of mysql follows non-static declaration
../../include/extern.h:1127: error: previous declaration of mysql was here
bs_gseen.c: In function do_seen:
bs_gseen.c:329: warning: suggest parentheses around assignment used as truth value
bs_gseen.c:378: warning: suggest parentheses around assignment used as truth value
bs_gseen.c:293: warning: unused variable is_online
bs_gseen.c: In function do_on_kick:
bs_gseen.c:501: warning: label MODCONT defined but not used
bs_gseen.c: In function do_on_quit:
bs_gseen.c:550: warning: label MODCONT defined but not used
bs_gseen.c: In function do_on_part:
bs_gseen.c:596: warning: label MODCONT defined but not used
bs_gseen.c: In function do_on_join:
bs_gseen.c:640: warning: unused variable now
make[1]: *** [bs_gseen.o] Error 1