This file contains any messages produced by compilers while
running configure, to aid debugging if configure makes a mistake.
configure:2136: checking for Cygwin environment
configure:2152: cc -c conftest.c 1>&5
configure: In function `main':
configure:2148: error: `__CYGWIN32__' undeclared (first use in this function)
configure:2148: error: (Each undeclared identifier is reported only once
configure:2148: error: for each function it appears in.)
configure: failed program was:
#line 2141 "configure"
#include "confdefs.h"
int main() {
#ifndef __CYGWIN__
#define __CYGWIN__ __CYGWIN32__
#endif
return __CYGWIN__;
; return 0; }
configure:2169: checking for mingw32 environment
configure:2181: cc -c conftest.c 1>&5
configure: In function `main':
configure:2177: error: `__MINGW32__' undeclared (first use in this function)
configure:2177: error: (Each undeclared identifier is reported only once
configure:2177: error: for each function it appears in.)
configure: failed program was:
#line 2174 "configure"
#include "confdefs.h"
int main() {
return __MINGW32__;
; return 0; }
configure:2200: checking for egrep
configure:2215: checking for a sed that does not truncate output
configure:2352: checking host system type
configure:2373: checking target system type
configure:2472: checking for gcc
configure:2585: checking whether the C compiler (gcc ) works
configure:2601: gcc -o conftest conftest.c 1>&5
configure:2627: checking whether the C compiler (gcc ) is a cross-compiler
configure:2632: checking whether we are using GNU C
configure:2641: gcc -E conftest.c
configure:2660: checking whether gcc accepts -g
configure:2693: checking whether gcc and cc understand -c and -o together
configure:2708: gcc -c conftest.c -o conftest.o 1>&5
configure:2709: gcc -c conftest.c -o conftest.o 1>&5
configure:2714: cc -c conftest.c 1>&5
configure:2716: cc -c conftest.c -o conftest.o 1>&5
configure:2717: cc -c conftest.c -o conftest.o 1>&5
configure:2744: checking how to run the C preprocessor
configure:2765: gcc -E conftest.c >/dev/null 2>conftest.out
configure:2824: checking for AIX
configure:2848: checking whether ln -s works
configure:2880: checking if compiler supports -R
configure:2895: gcc -o conftest -g -O2 conftest.c -R /usr/lib 1>&5
configure:2954: checking for re2c
configure:3014: checking for gawk
configure:3014: checking for nawk
configure:3055: checking if nawk is broken
configure:3074: checking for bison
configure:3114: checking for bison version
configure:3155: checking for flex
configure:3189: checking for yywrap in -lfl
configure:3208: gcc -o conftest -g -O2 conftest.c -lfl 1>&5
configure:3232: checking lex output file root
configure:3253: checking whether yytext is a pointer
configure:3272: gcc -o conftest -g -O2 conftest.c -lfl 1>&5
configure:3296: checking for working const
configure:3350: gcc -c -g -O2 conftest.c 1>&5
configure:3376: checking for flex version
configure:3599: checking whether to force non-PIC code in shared modules
configure:3695: gcc -o conftest -g -O2 conftest.c 1>&5
/tmp//ccT13208.o(.text+0x28): In function `main':
/root/php6.0-200610211030/configure:3690: undefined reference to `pthread_mutexattr_init'
/tmp//ccT13208.o(.text+0x3c):/root/php6.0-200610211030/configure:3691: undefined reference to `pthread_create'
collect2: ld returned 1 exit status
configure: failed program was:
#line 3677 "configure"
#include "confdefs.h"
#include <pthread.h>
#include <stddef.h>
void *thread_routine(void *data) {
return data;
}
int main() {
pthread_t thd;
pthread_mutexattr_t mattr;
int data = 1;
pthread_mutexattr_init(&mattr);
return pthread_create(&thd, NULL, thread_routine, &data);
}
configure:3715: checking for pthreads_cflags
configure:3755: gcc -o conftest -g -O2 -kthread conftest.c 1>&5
gcc: unrecognized option `-kthread'
/tmp//ccLgk611.o(.text+0x28): In function `main':
/root/php6.0-200610211030/configure:3750: undefined reference to `pthread_mutexattr_init'
/tmp//ccLgk611.o(.text+0x3c):/root/php6.0-200610211030/configure:3751: undefined reference to `pthread_create'
collect2: ld returned 1 exit status
configure: failed program was:
#line 3737 "configure"
#include "confdefs.h"
#include <pthread.h>
#include <stddef.h>
void *thread_routine(void *data) {
return data;
}
int main() {
pthread_t thd;
pthread_mutexattr_t mattr;
int data = 1;
pthread_mutexattr_init(&mattr);
return pthread_create(&thd, NULL, thread_routine, &data);
}
configure:3755: gcc -o conftest -g -O2 -pthread conftest.c 1>&5
configure:3785: checking for pthreads_lib
configure:3934: checking for AOLserver support
configure:4177: checking for Apache 1.x module support via DSO through APXS
configure:4482: checking for Apache 1.x module support
configure:5142: checking for mod_charset compatibility option
configure:5279: checking for Apache 2.0 filter-module support via DSO through APXS
configure:6109: checking for Apache 2.0 handler-module support via DSO through APXS
configure:6940: checking for Apache 1.x (hooks) module support via DSO through APXS
configure:7245: checking for Apache 1.x (hooks) module support
configure:7904: checking for mod_charset compatibility option
configure:8042: checking for Caudium support
configure:8374: checking for CLI build
configure:8432: checking for Continuity support
configure:8679: checking for embedded SAPI library support
configure:8902: checking for Zeus ISAPI support
configure:9134: checking for Milter support
configure:9409: checking for NSAPI support
configure:9752: checking for PHTTPD support
configure:9983: checking for Pi3Web support
configure:10314: checking for Roxen/Pike support
configure:10825: checking for thttpd
configure:11053: checking for TUX
configure:11289: checking for webjames
configure:11651: checking for chosen SAPI module
configure:11718: checking for sendmail
configure:11763: checking whether system uses EBCDIC
configure:11782: gcc -o conftest -g -O2 conftest.c 1>&5
configure: failed program was:
#line 11774 "configure"
#include "confdefs.h"
int main(void) {
return (unsigned char)'A' != (unsigned char)0xC1;
}
configure:11810: checking whether byte ordering is bigendian
configure:11836: gcc -o conftest -g -O2 conftest.c 1>&5
configure: failed program was:
#line 11820 "configure"
#include "confdefs.h"
int main(void)
{
short one = 1;
char *cp = (char *)&one;
if (*cp == 0) {
return(0);
} else {
return(1);
}
}
configure:11907: checking for socket
configure:11935: gcc -o conftest -g -O2 conftest.c 1>&5
configure:12164: checking for socketpair
configure:12192: gcc -o conftest -g -O2 conftest.c 1>&5
configure:12421: checking for htonl
configure:12449: gcc -o conftest -g -O2 conftest.c 1>&5
configure:12678: checking for gethostname
configure:12706: gcc -o conftest -g -O2 conftest.c 1>&5
configure:12935: checking for gethostbyaddr
configure:12963: gcc -o conftest -g -O2 conftest.c 1>&5
configure:13192: checking for yp_get_default_domain
configure:13220: gcc -o conftest -g -O2 conftest.c 1>&5
configure:13450: checking for dlopen
configure:13478: gcc -o conftest -g -O2 conftest.c 1>&5
configure:13708: checking for sin in -lm
configure:13727: gcc -o conftest -g -O2 conftest.c -lm 1>&5
configure:13720: warning: conflicting types for built-in function `sin'
configure:13761: checking for res_search
configure:13789: gcc -o conftest -g -O2 conftest.c -lm 1>&5
configure:14297: checking for inet_aton
configure:14325: gcc -o conftest -g -O2 conftest.c -lm 1>&5
configure:14693: checking for dn_skipname
configure:14721: gcc -o conftest -g -O2 conftest.c -lm 1>&5
/tmp//ccFT7410.o(.text+0x12): In function `main':
/root/php6.0-200610211030/configure:14715: undefined reference to `dn_skipname'
collect2: ld returned 1 exit status
configure: failed program was:
#line 14698 "configure"
#include "confdefs.h"
/* System header to define __stub macros and hopefully few prototypes,
which can conflict with char dn_skipname(); below. */
#include <assert.h>
/* Override any gcc2 internal prototype to avoid an error. */
/* We use char because int might match the return type of a gcc2
builtin and then its argument prototype would still apply. */
char dn_skipname();
int main() {
/* The GNU C library defines this for functions which it implements
to always fail with ENOSYS. Some functions are actually named
something starting with __ and the normal name is an alias. */
#if defined (__stub_dn_skipname) || defined (__stub___dn_skipname)
choke me
#else
dn_skipname();
#endif
; return 0; }
configure:14739: checking for __dn_skipname
configure:14767: gcc -o conftest -g -O2 conftest.c -lm 1>&5
configure:15087: checking for ANSI C header files
configure:15100: gcc -E conftest.c >/dev/null 2>conftest.out
configure:15167: gcc -o conftest -g -O2 conftest.c -lm 1>&5
configure:15195: checking for dirent.h that defines DIR
configure:15208: gcc -c -g -O2 conftest.c 1>&5
configure:15233: checking for opendir in -ldir
configure:15252: gcc -o conftest -g -O2 conftest.c -ldir -lm 1>&5
/usr/bin/ld: cannot find -ldir
collect2: ld returned 1 exit status
configure: failed program was:
#line 15241 "configure"
#include "confdefs.h"
/* Override any gcc2 internal prototype to avoid an error. */
/* We use char because int might match the return type of a gcc2
builtin and then its argument prototype would still apply. */
char opendir();
int main() {
opendir()
; return 0; }
configure:15374: checking for inttypes.h
configure:15384: gcc -E conftest.c >/dev/null 2>conftest.out
configure:15374: checking for stdint.h
configure:15384: gcc -E conftest.c >/dev/null 2>conftest.out
configure:15374: checking for dirent.h
configure:15384: gcc -E conftest.c >/dev/null 2>conftest.out
configure:15374: checking for ApplicationServices/ApplicationServices.h
configure:15384: gcc -E conftest.c >/dev/null 2>conftest.out
configure:15380:53: ApplicationServices/ApplicationServices.h: No such file or directory
configure: failed program was:
#line 15379 "configure"
#include "confdefs.h"
#include <ApplicationServices/ApplicationServices.h>
configure:15374: checking for sys/param.h
configure:15384: gcc -E conftest.c >/dev/null 2>conftest.out
configure:15374: checking for sys/types.h
configure:15384: gcc -E conftest.c >/dev/null 2>conftest.out
configure:15374: checking for sys/time.h
configure:15384: gcc -E conftest.c >/dev/null 2>conftest.out
configure:15374: checking for netinet/in.h
configure:15384: gcc -E conftest.c >/dev/null 2>conftest.out
configure:15374: checking for alloca.h
configure:15384: gcc -E conftest.c >/dev/null 2>conftest.out
configure:15380:20: alloca.h: No such file or directory
configure: failed program was:
#line 15379 "configure"
#include "confdefs.h"
#include <alloca.h>
configure:15374: checking for arpa/inet.h
configure:15384: gcc -E conftest.c >/dev/null 2>conftest.out
configure:15374: checking for arpa/nameser.h
configure:15384: gcc -E conftest.c >/dev/null 2>conftest.out
configure:15374: checking for assert.h
configure:15384: gcc -E conftest.c >/dev/null 2>conftest.out
configure:15374: checking for crypt.h
configure:15384: gcc -E conftest.c >/dev/null 2>conftest.out
configure:15380:19: crypt.h: No such file or directory
configure: failed program was:
#line 15379 "configure"
#include "confdefs.h"
#include <crypt.h>
configure:15374: checking for fcntl.h
configure:15384: gcc -E conftest.c >/dev/null 2>conftest.out
configure:15374: checking for grp.h
configure:15384: gcc -E conftest.c >/dev/null 2>conftest.out
configure:15374: checking for ieeefp.h
configure:15384: gcc -E conftest.c >/dev/null 2>conftest.out
configure:15374: checking for langinfo.h
configure:15384: gcc -E conftest.c >/dev/null 2>conftest.out
configure:15374: checking for limits.h
configure:15384: gcc -E conftest.c >/dev/null 2>conftest.out
configure:15374: checking for locale.h
configure:15384: gcc -E conftest.c >/dev/null 2>conftest.out
configure:15374: checking for monetary.h
configure:15384: gcc -E conftest.c >/dev/null 2>conftest.out
configure:15380:22: monetary.h: No such file or directory
configure: failed program was:
#line 15379 "configure"
#include "confdefs.h"
#include <monetary.h>
configure:15374: checking for mach-o/dyld.h
configure:15384: gcc -E conftest.c >/dev/null 2>conftest.out
configure:15380:25: mach-o/dyld.h: No such file or directory
configure: failed program was:
#line 15379 "configure"
#include "confdefs.h"
#include <mach-o/dyld.h>
configure:15374: checking for netdb.h
configure:15384: gcc -E conftest.c >/dev/null 2>conftest.out
configure:15374: checking for pwd.h
configure:15384: gcc -E conftest.c >/dev/null 2>conftest.out
configure:15374: checking for resolv.h
configure:15384: gcc -E conftest.c >/dev/null 2>conftest.out
configure:15374: checking for signal.h
configure:15384: gcc -E conftest.c >/dev/null 2>conftest.out
configure:15374: checking for stdarg.h
configure:15384: gcc -E conftest.c >/dev/null 2>conftest.out
configure:15374: checking for stdlib.h
configure:15384: gcc -E conftest.c >/dev/null 2>conftest.out
configure:15374: checking for string.h
configure:15384: gcc -E conftest.c >/dev/null 2>conftest.out
configure:15374: checking for syslog.h
configure:15384: gcc -E conftest.c >/dev/null 2>conftest.out
configure:15374: checking for sysexits.h
configure:15384: gcc -E conftest.c >/dev/null 2>conftest.out
configure:15374: checking for sys/ioctl.h
configure:15384: gcc -E conftest.c >/dev/null 2>conftest.out
configure:15374: checking for sys/file.h
configure:15384: gcc -E conftest.c >/dev/null 2>conftest.out
configure:15374: checking for sys/mman.h
configure:15384: gcc -E conftest.c >/dev/null 2>conftest.out
configure:15374: checking for sys/mount.h
configure:15384: gcc -E conftest.c >/dev/null 2>conftest.out
configure:15374: checking for sys/poll.h
configure:15384: gcc -E conftest.c >/dev/null 2>conftest.out
configure:15374: checking for sys/resource.h
configure:15384: gcc -E conftest.c >/dev/null 2>conftest.out
configure:15374: checking for sys/select.h
configure:15384: gcc -E conftest.c >/dev/null 2>conftest.out
configure:15374: checking for sys/socket.h
configure:15384: gcc -E conftest.c >/dev/null 2>conftest.out
configure:15374: checking for sys/statfs.h
configure:15384: gcc -E conftest.c >/dev/null 2>conftest.out
configure:15380:24: sys/statfs.h: No such file or directory
configure: failed program was:
#line 15379 "configure"
#include "confdefs.h"
#include <sys/statfs.h>
configure:15374: checking for sys/statvfs.h
configure:15384: gcc -E conftest.c >/dev/null 2>conftest.out
configure:15380:25: sys/statvfs.h: No such file or directory
configure: failed program was:
#line 15379 "configure"
#include "confdefs.h"
#include <sys/statvfs.h>
configure:15374: checking for sys/vfs.h
configure:15384: gcc -E conftest.c >/dev/null 2>conftest.out
configure:15380:21: sys/vfs.h: No such file or directory
configure: failed program was:
#line 15379 "configure"
#include "confdefs.h"
#include <sys/vfs.h>
configure:15374: checking for sys/sysexits.h
configure:15384: gcc -E conftest.c >/dev/null 2>conftest.out
configure:15380:26: sys/sysexits.h: No such file or directory
configure: failed program was:
#line 15379 "configure"
#include "confdefs.h"
#include <sys/sysexits.h>
configure:15374: checking for sys/varargs.h
configure:15384: gcc -E conftest.c >/dev/null 2>conftest.out
configure:15374: checking for sys/wait.h
configure:15384: gcc -E conftest.c >/dev/null 2>conftest.out
configure:15374: checking for sys/loadavg.h
configure:15384: gcc -E conftest.c >/dev/null 2>conftest.out
configure:15380:25: sys/loadavg.h: No such file or directory
configure: failed program was:
#line 15379 "configure"
#include "confdefs.h"
#include <sys/loadavg.h>
configure:15374: checking for termios.h
configure:15384: gcc -E conftest.c >/dev/null 2>conftest.out
configure:15374: checking for unistd.h
configure:15384: gcc -E conftest.c >/dev/null 2>conftest.out
configure:15374: checking for unix.h
configure:15384: gcc -E conftest.c >/dev/null 2>conftest.out
configure:15380:18: unix.h: No such file or directory
configure: failed program was:
#line 15379 "configure"
#include "confdefs.h"
#include <unix.h>
configure:15374: checking for utime.h
configure:15384: gcc -E conftest.c >/dev/null 2>conftest.out
configure:15374: checking for sys/utsname.h
configure:15384: gcc -E conftest.c >/dev/null 2>conftest.out
configure:15374: checking for sys/ipc.h
configure:15384: gcc -E conftest.c >/dev/null 2>conftest.out
configure:15374: checking for dlfcn.h
configure:15384: gcc -E conftest.c >/dev/null 2>conftest.out
configure:15374: checking for assert.h
configure:15413: checking for fopencookie
configure:15441: gcc -o conftest -g -O2 conftest.c -lm 1>&5
/tmp//ccM13760.o(.text+0x12): In function `main':
/root/php6.0-200610211030/configure:15435: undefined reference to `fopencookie'
collect2: ld returned 1 exit status
configure: failed program was:
#line 15418 "configure"
#include "confdefs.h"
/* System header to define __stub macros and hopefully few prototypes,
which can conflict with char fopencookie(); below. */
#include <assert.h>
/* Override any gcc2 internal prototype to avoid an error. */
/* We use char because int might match the return type of a gcc2
builtin and then its argument prototype would still apply. */
char fopencookie();
int main() {
/* The GNU C library defines this for functions which it implements
to always fail with ENOSYS. Some functions are actually named
something starting with __ and the normal name is an alias. */
#if defined (__stub_fopencookie) || defined (__stub___fopencookie)
choke me
#else
fopencookie();
#endif
; return 0; }
configure:15588: checking for broken getcwd
configure:15603: checking for broken libc stdio
configure:15664: gcc -o conftest -g -O2 conftest.c -lm 1>&5
configure:15692: checking whether struct tm is in sys/time.h or time.h
configure:15705: gcc -c -g -O2 conftest.c 1>&5
configure:15726: checking for tm_zone in struct tm
configure:15739: gcc -c -g -O2 conftest.c 1>&5
configure:15798: checking for missing declarations of reentrant functions
configure:15807: gcc -c -g -O2 conftest.c 1>&5
configure:15832: gcc -c -g -O2 conftest.c 1>&5
configure:15857: gcc -c -g -O2 conftest.c 1>&5
configure:15882: gcc -c -g -O2 conftest.c 1>&5
configure:15907: gcc -c -g -O2 conftest.c 1>&5
configure:15928: checking for fclose declaration
configure:15937: gcc -c -g -O2 conftest.c 1>&5
configure:15963: checking for tm_gmtoff in struct tm
configure:15976: gcc -c -g -O2 conftest.c 1>&5
configure:15999: checking for struct flock
configure:16014: gcc -c -g -O2 conftest.c 1>&5
configure:16041: checking for socklen_t
configure:16058: gcc -c -g -O2 conftest.c 1>&5
configure:16084: checking size of intmax_t
configure:16104: gcc -o conftest -g -O2 conftest.c -lm 1>&5
configure: In function `main':
configure:16099: error: `intmax_t' undeclared (first use in this function)
configure:16099: error: (Each undeclared identifier is reported only once
configure:16099: error: for each function it appears in.)
configure: failed program was:
#line 16092 "configure"
#include "confdefs.h"
#include <stdio.h>
#include <sys/types.h>
main()
{
FILE *f=fopen("conftestval", "w");
if (!f) exit(1);
fprintf(f, "%d\n", sizeof(intmax_t));
exit(0);
}
configure:16124: checking size of size_t
configure:16144: gcc -o conftest -g -O2 conftest.c -lm 1>&5
configure:16164: checking size of ssize_t
configure:16184: gcc -o conftest -g -O2 conftest.c -lm 1>&5
configure:16204: checking size of ptrdiff_t
configure:16224: gcc -o conftest -g -O2 conftest.c -lm 1>&5
configure: In function `main':
configure:16219: error: `ptrdiff_t' undeclared (first use in this function)
configure:16219: error: (Each undeclared identifier is reported only once
configure:16219: error: for each function it appears in.)
configure: failed program was:
#line 16212 "configure"
#include "confdefs.h"
#include <stdio.h>
#include <sys/types.h>
main()
{
FILE *f=fopen("conftestval", "w");
if (!f) exit(1);
fprintf(f, "%d\n", sizeof(ptrdiff_t));
exit(0);
}
configure:16244: checking size of long long
configure:16264: gcc -o conftest -g -O2 conftest.c -lm 1>&5
configure:16284: checking size of long long int
configure:16304: gcc -o conftest -g -O2 conftest.c -lm 1>&5
configure:16324: checking size of long
configure:16344: gcc -o conftest -g -O2 conftest.c -lm 1>&5
configure:16364: checking size of int
configure:16384: gcc -o conftest -g -O2 conftest.c -lm 1>&5
configure:16405: checking for st_blksize in struct stat
configure:16418: gcc -c -g -O2 conftest.c 1>&5
configure:16440: checking for st_blocks in struct stat
configure:16453: gcc -c -g -O2 conftest.c 1>&5
configure:16480: checking for st_rdev in struct stat
configure:16493: gcc -c -g -O2 conftest.c 1>&5
configure:16515: checking for size_t
configure:16548: checking for uid_t in sys/types.h
configure:16584: checking for struct sockaddr_storage
configure:16597: gcc -c -g -O2 conftest.c 1>&5
configure:16618: checking for field sa_len in struct sockaddr
configure:16632: gcc -c -g -O2 conftest.c 1>&5
configure:16655: checking for IPv6 support
configure:16669: gcc -o conftest -g -O2 conftest.c -lm 1>&5
configure:16685: checking for vprintf
configure:16713: gcc -o conftest -g -O2 conftest.c -lm 1>&5
configure:16697: warning: conflicting types for built-in function `vprintf'
configure:16869: checking for alphasort
configure:16897: gcc -o conftest -g -O2 conftest.c -lm 1>&5
configure:16869: checking for asctime_r
configure:16897: gcc -o conftest -g -O2 conftest.c -lm 1>&5
configure:16869: checking for chroot
configure:16897: gcc -o conftest -g -O2 conftest.c -lm 1>&5
configure:16869: checking for ctime_r
configure:16897: gcc -o conftest -g -O2 conftest.c -lm 1>&5
configure:16869: checking for cuserid
configure:16897: gcc -o conftest -g -O2 conftest.c -lm 1>&5
/tmp//cct21672.o(.text+0x12): In function `main':
/root/php6.0-200610211030/configure:16891: undefined reference to `cuserid'
collect2: ld returned 1 exit status
configure: failed program was:
#line 16874 "configure"
#include "confdefs.h"
/* System header to define __stub macros and hopefully few prototypes,
which can conflict with char cuserid(); below. */
#include <assert.h>
/* Override any gcc2 internal prototype to avoid an error. */
/* We use char because int might match the return type of a gcc2
builtin and then its argument prototype would still apply. */
char cuserid();
int main() {
/* The GNU C library defines this for functions which it implements
to always fail with ENOSYS. Some functions are actually named
something starting with __ and the normal name is an alias. */
#if defined (__stub_cuserid) || defined (__stub___cuserid)
choke me
#else
cuserid();
#endif
; return 0; }
configure:16869: checking for crypt
configure:16897: gcc -o conftest -g -O2 conftest.c -lm 1>&5
configure:16869: checking for flock
configure:16897: gcc -o conftest -g -O2 conftest.c -lm 1>&5
configure:16869: checking for ftok
configure:16897: gcc -o conftest -g -O2 conftest.c -lm 1>&5
configure:16869: checking for funopen
configure:16897: gcc -o conftest -g -O2 conftest.c -lm 1>&5
configure:16869: checking for gai_strerror
configure:16897: gcc -o conftest -g -O2 conftest.c -lm 1>&5
configure:16869: checking for gcvt
configure:16897: gcc -o conftest -g -O2 conftest.c -lm 1>&5
configure:16869: checking for getloadavg
configure:16897: gcc -o conftest -g -O2 conftest.c -lm 1>&5
configure:16869: checking for getlogin
configure:16897: gcc -o conftest -g -O2 conftest.c -lm 1>&5
configure:16869: checking for getprotobyname
configure:16897: gcc -o conftest -g -O2 conftest.c -lm 1>&5
configure:16869: checking for getprotobynumber
configure:16897: gcc -o conftest -g -O2 conftest.c -lm 1>&5
configure:16869: checking for getservbyname
configure:16897: gcc -o conftest -g -O2 conftest.c -lm 1>&5
configure:16869: checking for getservbyport
configure:16897: gcc -o conftest -g -O2 conftest.c -lm 1>&5
configure:16869: checking for getrusage
configure:16897: gcc -o conftest -g -O2 conftest.c -lm 1>&5
configure:16869: checking for gettimeofday
configure:16897: gcc -o conftest -g -O2 conftest.c -lm 1>&5
configure:16869: checking for gmtime_r
configure:16897: gcc -o conftest -g -O2 conftest.c -lm 1>&5
configure:16869: checking for grantpt
configure:16897: gcc -o conftest -g -O2 conftest.c -lm 1>&5
/tmp//ccGC5641.o(.text+0x12): In function `main':
/root/php6.0-200610211030/configure:16891: undefined reference to `grantpt'
collect2: ld returned 1 exit status
configure: failed program was:
#line 16874 "configure"
#include "confdefs.h"
/* System header to define __stub macros and hopefully few prototypes,
which can conflict with char grantpt(); below. */
#include <assert.h>
/* Override any gcc2 internal prototype to avoid an error. */
/* We use char because int might match the return type of a gcc2
builtin and then its argument prototype would still apply. */
char grantpt();
int main() {
/* The GNU C library defines this for functions which it implements
to always fail with ENOSYS. Some functions are actually named
something starting with __ and the normal name is an alias. */
#if defined (__stub_grantpt) || defined (__stub___grantpt)
choke me
#else
grantpt();
#endif
; return 0; }
configure:16869: checking for inet_ntoa
configure:16897: gcc -o conftest -g -O2 conftest.c -lm 1>&5
configure:16869: checking for inet_ntop
configure:16897: gcc -o conftest -g -O2 conftest.c -lm 1>&5
configure:16869: checking for inet_pton
configure:16897: gcc -o conftest -g -O2 conftest.c -lm 1>&5
configure:16869: checking for isascii
configure:16897: gcc -o conftest -g -O2 conftest.c -lm 1>&5
configure:16869: checking for link
configure:16897: gcc -o conftest -g -O2 conftest.c -lm 1>&5
configure:16869: checking for localtime_r
configure:16897: gcc -o conftest -g -O2 conftest.c -lm 1>&5
configure:16869: checking for lockf
configure:16897: gcc -o conftest -g -O2 conftest.c -lm 1>&5
configure:16869: checking for lchown
configure:16897: gcc -o conftest -g -O2 conftest.c -lm 1>&5
configure:16869: checking for lrand48
configure:16897: gcc -o conftest -g -O2 conftest.c -lm 1>&5
configure:16869: checking for memcpy
configure:16897: gcc -o conftest -g -O2 conftest.c -lm 1>&5
configure:16881: warning: conflicting types for built-in function `memcpy'
configure:16869: checking for memmove
configure:16897: gcc -o conftest -g -O2 conftest.c -lm 1>&5
configure:16869: checking for mkstemp
configure:16897: gcc -o conftest -g -O2 conftest.c -lm 1>&5
configure:16869: checking for mmap
configure:16897: gcc -o conftest -g -O2 conftest.c -lm 1>&5
configure:16869: checking for nl_langinfo
configure:16897: gcc -o conftest -g -O2 conftest.c -lm 1>&5
configure:16869: checking for perror
configure:16897: gcc -o conftest -g -O2 conftest.c -lm 1>&5
configure:16869: checking for poll
configure:16897: gcc -o conftest -g -O2 conftest.c -lm 1>&5
configure:16869: checking for ptsname
configure:16897: gcc -o conftest -g -O2 conftest.c -lm 1>&5
/tmp//ccK31974.o(.text+0x12): In function `main':
/root/php6.0-200610211030/configure:16891: undefined reference to `ptsname'
collect2: ld returned 1 exit status
configure: failed program was:
#line 16874 "configure"
#include "confdefs.h"
/* System header to define __stub macros and hopefully few prototypes,
which can conflict with char ptsname(); below. */
#include <assert.h>
/* Override any gcc2 internal prototype to avoid an error. */
/* We use char because int might match the return type of a gcc2
builtin and then its argument prototype would still apply. */
char ptsname();
int main() {
/* The GNU C library defines this for functions which it implements
to always fail with ENOSYS. Some functions are actually named
something starting with __ and the normal name is an alias. */
#if defined (__stub_ptsname) || defined (__stub___ptsname)
choke me
#else
ptsname();
#endif
; return 0; }
configure:16869: checking for putenv
configure:16897: gcc -o conftest -g -O2 conftest.c -lm 1>&5
configure:16869: checking for realpath
configure:16897: gcc -o conftest -g -O2 conftest.c -lm 1>&5
configure:16869: checking for random
configure:16897: gcc -o conftest -g -O2 conftest.c -lm 1>&5
configure:16869: checking for rand_r
configure:16897: gcc -o conftest -g -O2 conftest.c -lm 1>&5
configure:16869: checking for regcomp
configure:16897: gcc -o conftest -g -O2 conftest.c -lm 1>&5
configure:16869: checking for res_search
configure:16869: checking for scandir
configure:16897: gcc -o conftest -g -O2 conftest.c -lm 1>&5
configure:16869: checking for setitimer
configure:16897: gcc -o conftest -g -O2 conftest.c -lm 1>&5
configure:16869: checking for setlocale
configure:16897: gcc -o conftest -g -O2 conftest.c -lm 1>&5
configure:16869: checking for localeconv
configure:16897: gcc -o conftest -g -O2 conftest.c -lm 1>&5
configure:16869: checking for setenv
configure:16897: gcc -o conftest -g -O2 conftest.c -lm 1>&5
configure:16869: checking for setpgid
configure:16897: gcc -o conftest -g -O2 conftest.c -lm 1>&5
configure:16869: checking for setsockopt
configure:16897: gcc -o conftest -g -O2 conftest.c -lm 1>&5
configure:16869: checking for setvbuf
configure:16897: gcc -o conftest -g -O2 conftest.c -lm 1>&5
configure:16869: checking for shutdown
configure:16897: gcc -o conftest -g -O2 conftest.c -lm 1>&5
configure:16869: checking for sin
configure:16897: gcc -o conftest -g -O2 conftest.c -lm 1>&5
configure:16881: warning: conflicting types for built-in function `sin'
configure:16869: checking for snprintf
configure:16897: gcc -o conftest -g -O2 conftest.c -lm 1>&5
configure:16881: warning: conflicting types for built-in function `snprintf'
configure:16869: checking for srand48
configure:16897: gcc -o conftest -g -O2 conftest.c -lm 1>&5
configure:16869: checking for srandom
configure:16897: gcc -o conftest -g -O2 conftest.c -lm 1>&5
configure:16869: checking for statfs
configure:16897: gcc -o conftest -g -O2 conftest.c -lm 1>&5
configure:16869: checking for statvfs
configure:16897: gcc -o conftest -g -O2 conftest.c -lm 1>&5
/tmp//ccsx9838.o(.text+0x12): In function `main':
/root/php6.0-200610211030/configure:16891: undefined reference to `statvfs'
collect2: ld returned 1 exit status
configure: failed program was:
#line 16874 "configure"
#include "confdefs.h"
/* System header to define __stub macros and hopefully few prototypes,
which can conflict with char statvfs(); below. */
#include <assert.h>
/* Override any gcc2 internal prototype to avoid an error. */
/* We use char because int might match the return type of a gcc2
builtin and then its argument prototype would still apply. */
char statvfs();
int main() {
/* The GNU C library defines this for functions which it implements
to always fail with ENOSYS. Some functions are actually named
something starting with __ and the normal name is an alias. */
#if defined (__stub_statvfs) || defined (__stub___statvfs)
choke me
#else
statvfs();
#endif
; return 0; }
configure:16869: checking for std_syslog
configure:16897: gcc -o conftest -g -O2 conftest.c -lm 1>&5
/tmp//ccTG9985.o(.text+0x12): In function `main':
/root/php6.0-200610211030/configure:16891: undefined reference to `std_syslog'
collect2: ld returned 1 exit status
configure: failed program was:
#line 16874 "configure"
#include "confdefs.h"
/* System header to define __stub macros and hopefully few prototypes,
which can conflict with char std_syslog(); below. */
#include <assert.h>
/* Override any gcc2 internal prototype to avoid an error. */
/* We use char because int might match the return type of a gcc2
builtin and then its argument prototype would still apply. */
char std_syslog();
int main() {
/* The GNU C library defines this for functions which it implements
to always fail with ENOSYS. Some functions are actually named
something starting with __ and the normal name is an alias. */
#if defined (__stub_std_syslog) || defined (__stub___std_syslog)
choke me
#else
std_syslog();
#endif
; return 0; }
configure:16869: checking for strcasecmp
configure:16897: gcc -o conftest -g -O2 conftest.c -lm 1>&5
configure:16869: checking for strcoll
configure:16897: gcc -o conftest -g -O2 conftest.c -lm 1>&5
configure:16869: checking for strdup
configure:16897: gcc -o conftest -g -O2 conftest.c -lm 1>&5
configure:16869: checking for strerror
configure:16897: gcc -o conftest -g -O2 conftest.c -lm 1>&5
configure:16869: checking for strftime
configure:16897: gcc -o conftest -g -O2 conftest.c -lm 1>&5
configure:16869: checking for strptime
configure:16897: gcc -o conftest -g -O2 conftest.c -lm 1>&5
configure:16869: checking for strstr
configure:16897: gcc -o conftest -g -O2 conftest.c -lm 1>&5
configure:16881: warning: conflicting types for built-in function `strstr'
configure:16869: checking for strtok_r
configure:16897: gcc -o conftest -g -O2 conftest.c -lm 1>&5
configure:16869: checking for symlink
configure:16897: gcc -o conftest -g -O2 conftest.c -lm 1>&5
configure:16869: checking for tempnam
configure:16897: gcc -o conftest -g -O2 conftest.c -lm 1>&5
/tmp//ccf25006.o(.text+0x12): In function `main':
/root/php6.0-200610211030/configure:16891: warning: tempnam() possibly used unsafely; consider using mkstemp()
configure:16869: checking for tzset
configure:16897: gcc -o conftest -g -O2 conftest.c -lm 1>&5
configure:16869: checking for unlockpt
configure:16897: gcc -o conftest -g -O2 conftest.c -lm 1>&5
/tmp//ccS19306.o(.text+0x12): In function `main':
/root/php6.0-200610211030/configure:16891: undefined reference to `unlockpt'
collect2: ld returned 1 exit status
configure: failed program was:
#line 16874 "configure"
#include "confdefs.h"
/* System header to define __stub macros and hopefully few prototypes,
which can conflict with char unlockpt(); below. */
#include <assert.h>
/* Override any gcc2 internal prototype to avoid an error. */
/* We use char because int might match the return type of a gcc2
builtin and then its argument prototype would still apply. */
char unlockpt();
int main() {
/* The GNU C library defines this for functions which it implements
to always fail with ENOSYS. Some functions are actually named
something starting with __ and the normal name is an alias. */
#if defined (__stub_unlockpt) || defined (__stub___unlockpt)
choke me
#else
unlockpt();
#endif
; return 0; }
configure:16869: checking for unsetenv
configure:16897: gcc -o conftest -g -O2 conftest.c -lm 1>&5
configure:16869: checking for usleep
configure:16897: gcc -o conftest -g -O2 conftest.c -lm 1>&5
configure:16869: checking for nanosleep
configure:16897: gcc -o conftest -g -O2 conftest.c -lm 1>&5
configure:16869: checking for utime
configure:16897: gcc -o conftest -g -O2 conftest.c -lm 1>&5
configure:16869: checking for vsnprintf
configure:16897: gcc -o conftest -g -O2 conftest.c -lm 1>&5
configure:16881: warning: conflicting types for built-in function `vsnprintf'
configure:16923: checking for getaddrinfo
configure:16935: gcc -o conftest -g -O2 conftest.c -lm 1>&5
configure:16981: gcc -o conftest -g -O2 conftest.c -lm 1>&5
configure:17013: checking for strlcat
configure:17041: gcc -o conftest -g -O2 conftest.c -lm 1>&5
configure:17013: checking for strlcpy
configure:17041: gcc -o conftest -g -O2 conftest.c -lm 1>&5
configure:17013: checking for getopt
configure:17041: gcc -o conftest -g -O2 conftest.c -lm 1>&5
configure:17068: checking whether utime accepts a null argument
configure:17089: gcc -o conftest -g -O2 conftest.c -lm 1>&5
configure:17115: checking for working alloca.h
configure:17148: checking for alloca
configure:17181: gcc -o conftest -g -O2 conftest.c -lm 1>&5
configure:17348: checking for declared timezone
configure:17369: gcc -c -g -O2 conftest.c 1>&5
configure:17395: checking for type of reentrant time-related functions
configure:17424: gcc -o conftest -g -O2 conftest.c -lm 1>&5
configure: In function `main':
configure:17416: warning: assignment makes integer from pointer without a cast
configure:17417: error: too many arguments to function `asctime_r'
configure: failed program was:
#line 17406 "configure"
#include "confdefs.h"
#include <time.h>
main() {
char buf[27];
struct tm t;
time_t old = 0;
int r, s;
s = gmtime_r(&old, &t);
r = (int) asctime_r(&t, buf, 26);
if (r == s && s == 0) return (0);
return (1);
}
configure:17456: gcc -o conftest -g -O2 conftest.c -lm 1>&5
configure: In function `main':
configure:17449: error: too many arguments to function `asctime_r'
configure: failed program was:
#line 17440 "configure"
#include "confdefs.h"
#include <time.h>
main() {
struct tm t, *s;
time_t old = 0;
char buf[27], *p;
s = gmtime_r(&old, &t);
p = asctime_r(&t, buf, 26);
if (p == buf && s == &t) return (0);
return (1);
}
configure:17494: checking for readdir_r
configure:17522: gcc -o conftest -g -O2 conftest.c -lm 1>&5
configure:17544: checking for type of readdir_r
configure:17580: gcc -o conftest -g -O2 conftest.c -lm 1>&5
configure:17643: checking for in_addr_t
configure:17699: checking whether to include gcov symbols
configure:17861: checking whether to include debugging symbols
configure:17900: checking layout of installed files
configure:17934: checking path to configuration file
configure:17970: checking where to scan for configuration files
configure:18000: checking whether to enable PHP's own SIGCHLD handler
configure:18037: checking whether to enable runpaths
configure:18062: checking whether to explicitly link against libgcc
configure:18141: checking whether to enable short tags by default
configure:18178: checking whether to enable dmalloc
configure:18266: checking whether to enable IPv6 support
configure:18296: checking how big to make fd sets
configure:18316: checking whether to enable versioning
configure:18332: checking for location of ICU headers and libraries
configure:18370: checking for ICU 3.4 or greater
configure:18530: checking whether to enable LIBXML support
configure:18577: checking libxml2 install dir
configure:18606: checking for xml2-config path
configure:18763: checking whether libxml build works
configure:18790: gcc -o conftest -g -O2 -R/usr/local/lib -L/usr/local/lib conftest.c
-lm -lm -licui18n -licuuc -licudata -lm -licuio -lxml2 -lz -lm 1>&5
/usr/local/lib/libicui18n.so.36.0: warning: strcpy() is almost always misused, please use strlcpy()
/usr/local/lib/libicui18n.so.36.0: warning: sprintf() is often misused, please use snprintf()
/usr/local/lib/libicui18n.so.36.0: warning: strcat() is almost always misused, please use strlcat()
/usr/local/lib/libicuio.so.36.0: undefined reference to `std::basic_ostream<char, std::char_traits<char> >::write(char const*, long)'
/usr/local/lib/libicuio.so.36.0: undefined reference to `std::basic_istream<char, std::char_traits<char> >::putback(char)'
/usr/local/lib/libicuio.so.36.0: undefined reference to `std::ios_base::Init::Init[in-charge]()'
/usr/local/lib/libicuio.so.36.0: undefined reference to `std::ios_base::Init::~Init [in-charge]()'
/usr/local/lib/libicuio.so.36.0: undefined reference to `std::basic_istream<char, std::char_traits<char> >::get()'
collect2: ld returned 1 exit status
configure: failed program was:
#line 18779 "configure"
#include "confdefs.h"
char xmlInitParser();
int main() {
xmlInitParser();
return 0;
}