All pastes #21323 Raw Edit

Unnamed

public text v1 · immutable
#21323 ·published 2005-08-27 21:31 UTC
rendered paste body
make[3]: Leaving directory `/tmp/gnome/dbus/python/examples'
make[3]: Entering directory `/tmp/gnome/dbus/python'
pyrexc ./dbus_bindings.pyx -I. -o ./dbus_bindings.c
Traceback (most recent call last):
  File "/usr/bin/pyrexc", line 7, in ?
    from Pyrex.Compiler.Main import main
  File "/usr/lib/python2.4/site-packages/Pyrex/Compiler/Main.py", line 13, in ?
    from Scanning import PyrexScanner
  File "/usr/lib/python2.4/site-packages/Pyrex/Compiler/Scanning.py", line 6, in ?
    import cPickle as pickle
ImportError: /usr/lib/python2.4/lib-dynload/cPickle.so: undefined symbol: PyUnicodeUCS4_AsUTF8String
make[3]: [dbus_bindings.c] Fehler 1 (ignoriert)
if /bin/sh ../libtool --tag=CC --mode=compile gcc -DHAVE_CONFIG_H -I. -I. -I.. -I./.. -I./../dbus  -I/opt/gnome212/include/python2.4 -DDBUS_COMPILATION=1  -DDBUS_API_SUBJECT_TO_CHANGE=1   -g -Wall -Wchar-subscripts -Wmissing-declarations -Wmissing-prototypes -Wnested-externs -Wpointer-arith -Wcast-align -Wfloat-equal -Wsign-compare -MT dbus_bindings.lo -MD -MP -MF ".deps/dbus_bindings.Tpo" -c -o dbus_bindings.lo dbus_bindings.c; \
then mv -f ".deps/dbus_bindings.Tpo" ".deps/dbus_bindings.Plo"; else rm -f ".deps/dbus_bindings.Tpo"; exit 1; fi
 gcc -DHAVE_CONFIG_H -I. -I. -I.. -I./.. -I./../dbus -I/opt/gnome212/include/python2.4 -DDBUS_COMPILATION=1 -DDBUS_API_SUBJECT_TO_CHANGE=1 -g -Wall -Wchar-subscripts -Wmissing-declarations -Wmissing-prototypes -Wnested-externs -Wpointer-arith -Wcast-align -Wfloat-equal -Wsign-compare -MT dbus_bindings.lo -MD -MP -MF .deps/dbus_bindings.Tpo -c dbus_bindings.c  -fPIC -DPIC -o .libs/dbus_bindings.o
gcc: dbus_bindings.c: No such file or directory
gcc: no input files
make[3]: *** [dbus_bindings.lo] Fehler 1
make[3]: Leaving directory `/tmp/gnome/dbus/python'
make[2]: *** [all-recursive] Fehler 1
make[2]: Leaving directory `/tmp/gnome/dbus/python'
make[1]: *** [all-recursive] Fehler 1
make[1]: Leaving directory `/tmp/gnome/dbus'
make: *** [all] Fehler 2