All pastes #212783 Raw Edit

Mine

public text v1 · immutable
#212783 ·published 2006-10-21 01:27 UTC
rendered paste body
This file contains any messages produced by compilers while
running configure, to aid debugging if configure makes a mistake.

It was created by gnumeric configure 1.6.0, which was
generated by GNU Autoconf 2.59.  Invocation command line was

  $ ./configure 

## --------- ##
## Platform. ##
## --------- ##

hostname = localhost
uname -m = i686
uname -r = 2.6.17-5mdv
uname -s = Linux
uname -v = #1 SMP Wed Sep 13 14:32:31 EDT 2006

/usr/bin/uname -p = unknown
/bin/uname -X     = unknown

/bin/arch              = i686
/usr/bin/arch -k       = unknown
/usr/convex/getsysinfo = unknown
hostinfo               = unknown
/bin/machine           = unknown
/usr/bin/oslevel       = unknown
/bin/universe          = unknown

PATH: /home/apps/tomcat/j2se/bin
PATH: /usr/bin
PATH: /bin
PATH: /usr/local/bin
PATH: /usr/X11R6/bin/
PATH: /usr/games
PATH: /usr/lib/qt3/bin
PATH: .
PATH: /home/rvd/bin
PATH: /usr/lib/qt3/bin


## ----------- ##
## Core tests. ##
## ----------- ##

configure:1725: checking for a BSD-compatible install
configure:1780: result: /usr/bin/install -c
configure:1791: checking whether build environment is sane
configure:1834: result: yes
configure:1891: checking for gawk
configure:1907: found /usr/bin/gawk
configure:1917: result: gawk
configure:1927: checking whether make sets $(MAKE)
configure:1947: result: yes
configure:2114: checking whether to enable maintainer-specific portions of Makefiles
configure:2123: result: no
configure:2169: checking for intltool >= 0.29
configure:2179: result: 0.34.1 found
configure:2236: checking for perl
configure:2254: found /usr/bin/perl
configure:2266: result: /usr/bin/perl
configure:2284: checking for XML::Parser
configure:2287: result: ok
configure:2298: checking for iconv
configure:2316: found /usr/bin/iconv
configure:2329: result: /usr/bin/iconv
configure:2338: checking for msgfmt
configure:2369: result: msgfmt
configure:2378: checking for msgmerge
configure:2409: result: msgmerge
configure:2418: checking for xgettext
configure:2449: result: xgettext
configure:2478: checking build system type
configure:2496: result: i686-pc-linux-gnu
configure:2504: checking host system type
configure:2518: result: i686-pc-linux-gnu
configure:2539: checking for style of include used by make
configure:2567: result: GNU
configure:2638: checking for gcc
configure:2654: found /usr/bin/gcc
configure:2664: result: gcc
configure:2908: checking for C compiler version
configure:2911: gcc --version </dev/null >&5
gcc (GCC) 4.1.1 20060724 (prerelease) (4.1.1-3mdk)
Copyright (C) 2006 Free Software Foundation, Inc.
This is free software; see the source for copying conditions.  There is NO
warranty; not even for MERCHANTABILITY or FITNESS FOR A PARTICULAR PURPOSE.

configure:2914: $? = 0
configure:2916: gcc -v </dev/null >&5
Using built-in specs.
Target: i586-mandriva-linux-gnu
Configured with: ../configure --prefix=/usr --libexecdir=/usr/lib --with-slibdir=/lib --mandir=/usr/share/man --infodir=/usr/share/info --enable-shared --enable-threads=posix --enable-checking=release --enable-languages=c,c++,ada,fortran,objc,obj-c++,java --host=i586-mandriva-linux-gnu --with-cpu=generic --with-system-zlib --enable-long-long --enable-__cxa_atexit --enable-clocale=gnu --disable-libunwind-exceptions --enable-java-awt=gtk --with-java-home=/usr/lib/jvm/java-1.4.2-gcj-1.4.2.0/jre --enable-gtk-cairo --enable-ssp --disable-libssp
Thread model: posix
gcc version 4.1.1 20060724 (prerelease) (4.1.1-3mdk)
configure:2919: $? = 0
configure:2921: gcc -V </dev/null >&5
gcc: '-V' option must have argument
configure:2924: $? = 1
configure:2947: checking for C compiler default output file name
configure:2950: gcc    conftest.c  >&5
configure:2953: $? = 0
configure:2999: result: a.out
configure:3004: checking whether the C compiler works
configure:3010: ./a.out
configure:3013: $? = 0
configure:3030: result: yes
configure:3037: checking whether we are cross compiling
configure:3039: result: no
configure:3042: checking for suffix of executables
configure:3044: gcc -o conftest    conftest.c  >&5
configure:3047: $? = 0
configure:3072: result: 
configure:3078: checking for suffix of object files
configure:3099: gcc -c   conftest.c >&5
configure:3102: $? = 0
configure:3124: result: o
configure:3128: checking whether we are using the GNU C compiler
configure:3152: gcc -c   conftest.c >&5
configure:3158: $? = 0
configure:3161: test -z 			 || test ! -s conftest.err
configure:3164: $? = 0
configure:3167: test -s conftest.o
configure:3170: $? = 0
configure:3183: result: yes
configure:3189: checking whether gcc accepts -g
configure:3210: gcc -c -g  conftest.c >&5
configure:3216: $? = 0
configure:3219: test -z 			 || test ! -s conftest.err
configure:3222: $? = 0
configure:3225: test -s conftest.o
configure:3228: $? = 0
configure:3239: result: yes
configure:3256: checking for gcc option to accept ANSI C
configure:3326: gcc  -c -g -O2  conftest.c >&5
configure:3332: $? = 0
configure:3335: test -z 			 || test ! -s conftest.err
configure:3338: $? = 0
configure:3341: test -s conftest.o
configure:3344: $? = 0
configure:3362: result: none needed
configure:3380: gcc -c -g -O2  conftest.c >&5
conftest.c:2: error: expected '=', ',', ';', 'asm' or '__attribute__' before 'me'
configure:3386: $? = 1
configure: failed program was:
| #ifndef __cplusplus
|   choke me
| #endif
configure:3518: checking dependency style of gcc
configure:3608: result: gcc3
configure:3626: checking for library containing strerror
configure:3656: gcc -o conftest -g -O2   conftest.c  >&5
configure:3662: $? = 0
configure:3665: test -z 			 || test ! -s conftest.err
configure:3668: $? = 0
configure:3671: test -s conftest
configure:3674: $? = 0
configure:3743: result: none required
configure:3796: checking for gcc
configure:3822: result: gcc
configure:4066: checking for C compiler version
configure:4069: gcc --version </dev/null >&5
gcc (GCC) 4.1.1 20060724 (prerelease) (4.1.1-3mdk)
Copyright (C) 2006 Free Software Foundation, Inc.
This is free software; see the source for copying conditions.  There is NO
warranty; not even for MERCHANTABILITY or FITNESS FOR A PARTICULAR PURPOSE.

configure:4072: $? = 0
configure:4074: gcc -v </dev/null >&5
Using built-in specs.
Target: i586-mandriva-linux-gnu
Configured with: ../configure --prefix=/usr --libexecdir=/usr/lib --with-slibdir=/lib --mandir=/usr/share/man --infodir=/usr/share/info --enable-shared --enable-threads=posix --enable-checking=release --enable-languages=c,c++,ada,fortran,objc,obj-c++,java --host=i586-mandriva-linux-gnu --with-cpu=generic --with-system-zlib --enable-long-long --enable-__cxa_atexit --enable-clocale=gnu --disable-libunwind-exceptions --enable-java-awt=gtk --with-java-home=/usr/lib/jvm/java-1.4.2-gcj-1.4.2.0/jre --enable-gtk-cairo --enable-ssp --disable-libssp
Thread model: posix
gcc version 4.1.1 20060724 (prerelease) (4.1.1-3mdk)
configure:4077: $? = 0
configure:4079: gcc -V </dev/null >&5
gcc: '-V' option must have argument
configure:4082: $? = 1
configure:4085: checking whether we are using the GNU C compiler
configure:4140: result: yes
configure:4146: checking whether gcc accepts -g
configure:4196: result: yes
configure:4213: checking for gcc option to accept ANSI C
configure:4319: result: none needed
configure:4337: gcc -c -g -O2  conftest.c >&5
conftest.c:2: error: expected '=', ',', ';', 'asm' or '__attribute__' before 'me'
configure:4343: $? = 1
configure: failed program was:
| #ifndef __cplusplus
|   choke me
| #endif
configure:4475: checking dependency style of gcc
configure:4565: result: gcc3
configure:4586: checking for bison
configure:4615: result: no
configure:4586: checking for byacc
configure:4615: result: no
configure:4627: checking for flex
configure:4656: result: no
configure:4627: checking for lex
configure:4656: result: no
configure:4666: checking for yywrap in -lfl
configure:4696: gcc -o conftest -g -O2   conftest.c -lfl   >&5
/usr/bin/ld: cannot find -lfl
collect2: ld returned 1 exit status
configure:4702: $? = 1
configure: failed program was:
| /* confdefs.h.  */
| 
| #define PACKAGE_NAME "gnumeric"
| #define PACKAGE_TARNAME "gnumeric"
| #define PACKAGE_VERSION "1.6.0"
| #define PACKAGE_STRING "gnumeric 1.6.0"
| #define PACKAGE_BUGREPORT "http://bugzilla.gnome.org/enter_bug.cgi?product=gnumeric"
| #define PACKAGE "gnumeric"
| #define VERSION "1.6.0"
| /* end confdefs.h.  */
| 
| /* Override any gcc2 internal prototype to avoid an error.  */
| #ifdef __cplusplus
| extern "C"
| #endif
| /* We use char because int might match the return type of a gcc2
|    builtin and then its argument prototype would still apply.  */
| char yywrap ();
| int
| main ()
| {
| yywrap ();
|   ;
|   return 0;
| }
configure:4727: result: no
configure:4732: checking for yywrap in -ll
configure:4762: gcc -o conftest -g -O2   conftest.c -ll   >&5
/usr/bin/ld: cannot find -ll
collect2: ld returned 1 exit status
configure:4768: $? = 1
configure: failed program was:
| /* confdefs.h.  */
| 
| #define PACKAGE_NAME "gnumeric"
| #define PACKAGE_TARNAME "gnumeric"
| #define PACKAGE_VERSION "1.6.0"
| #define PACKAGE_STRING "gnumeric 1.6.0"
| #define PACKAGE_BUGREPORT "http://bugzilla.gnome.org/enter_bug.cgi?product=gnumeric"
| #define PACKAGE "gnumeric"
| #define VERSION "1.6.0"
| /* end confdefs.h.  */
| 
| /* Override any gcc2 internal prototype to avoid an error.  */
| #ifdef __cplusplus
| extern "C"
| #endif
| /* We use char because int might match the return type of a gcc2
|    builtin and then its argument prototype would still apply.  */
| char yywrap ();
| int
| main ()
| {
| yywrap ();
|   ;
|   return 0;
| }
configure:4793: result: no
configure:4897: checking whether ln -s works
configure:4901: result: yes
configure:4956: checking for a sed that does not truncate output
configure:5010: result: /bin/sed
configure:5013: checking for egrep
configure:5023: result: grep -E
configure:5039: checking for ld used by gcc
configure:5106: result: /usr/bin/ld
configure:5115: checking if the linker (/usr/bin/ld) is GNU ld
configure:5130: result: yes
configure:5135: checking for /usr/bin/ld option to reload object files
configure:5142: result: -r
configure:5160: checking for BSD-compatible nm
configure:5202: result: /usr/bin/nm -B
configure:5206: checking how to recognise dependent libraries
configure:5378: result: pass_all
configure:5590: checking how to run the C preprocessor
configure:5625: gcc -E  conftest.c
configure:5631: $? = 0
configure:5663: gcc -E  conftest.c
conftest.c:11:28: error: ac_nonexistent.h: No such file or directory
configure:5669: $? = 1
configure: failed program was:
| /* confdefs.h.  */
| 
| #define PACKAGE_NAME "gnumeric"
| #define PACKAGE_TARNAME "gnumeric"
| #define PACKAGE_VERSION "1.6.0"
| #define PACKAGE_STRING "gnumeric 1.6.0"
| #define PACKAGE_BUGREPORT "http://bugzilla.gnome.org/enter_bug.cgi?product=gnumeric"
| #define PACKAGE "gnumeric"
| #define VERSION "1.6.0"
| /* end confdefs.h.  */
| #include <ac_nonexistent.h>
configure:5708: result: gcc -E
configure:5732: gcc -E  conftest.c
configure:5738: $? = 0
configure:5770: gcc -E  conftest.c
conftest.c:11:28: error: ac_nonexistent.h: No such file or directory
configure:5776: $? = 1
configure: failed program was:
| /* confdefs.h.  */
| 
| #define PACKAGE_NAME "gnumeric"
| #define PACKAGE_TARNAME "gnumeric"
| #define PACKAGE_VERSION "1.6.0"
| #define PACKAGE_STRING "gnumeric 1.6.0"
| #define PACKAGE_BUGREPORT "http://bugzilla.gnome.org/enter_bug.cgi?product=gnumeric"
| #define PACKAGE "gnumeric"
| #define VERSION "1.6.0"
| /* end confdefs.h.  */
| #include <ac_nonexistent.h>
configure:5820: checking for ANSI C header files
configure:5845: gcc -c -g -O2  conftest.c >&5
configure:5851: $? = 0
configure:5854: test -z 			 || test ! -s conftest.err
configure:5857: $? = 0
configure:5860: test -s conftest.o
configure:5863: $? = 0
configure:5952: gcc -o conftest -g -O2   conftest.c  >&5
conftest.c: In function 'main':
conftest.c:28: warning: incompatible implicit declaration of built-in function 'exit'
configure:5955: $? = 0
configure:5957: ./conftest
configure:5960: $? = 0
configure:5975: result: yes
configure:5999: checking for sys/types.h
configure:6015: gcc -c -g -O2  conftest.c >&5
configure:6021: $? = 0
configure:6024: test -z 			 || test ! -s conftest.err
configure:6027: $? = 0
configure:6030: test -s conftest.o
configure:6033: $? = 0
configure:6044: result: yes
configure:5999: checking for sys/stat.h
configure:6015: gcc -c -g -O2  conftest.c >&5
configure:6021: $? = 0
configure:6024: test -z 			 || test ! -s conftest.err
configure:6027: $? = 0
configure:6030: test -s conftest.o
configure:6033: $? = 0
configure:6044: result: yes
configure:5999: checking for stdlib.h
configure:6015: gcc -c -g -O2  conftest.c >&5
configure:6021: $? = 0
configure:6024: test -z 			 || test ! -s conftest.err
configure:6027: $? = 0
configure:6030: test -s conftest.o
configure:6033: $? = 0
configure:6044: result: yes
configure:5999: checking for string.h
configure:6015: gcc -c -g -O2  conftest.c >&5
configure:6021: $? = 0
configure:6024: test -z 			 || test ! -s conftest.err
configure:6027: $? = 0
configure:6030: test -s conftest.o
configure:6033: $? = 0
configure:6044: result: yes
configure:5999: checking for memory.h
configure:6015: gcc -c -g -O2  conftest.c >&5
configure:6021: $? = 0
configure:6024: test -z 			 || test ! -s conftest.err
configure:6027: $? = 0
configure:6030: test -s conftest.o
configure:6033: $? = 0
configure:6044: result: yes
configure:5999: checking for strings.h
configure:6015: gcc -c -g -O2  conftest.c >&5
configure:6021: $? = 0
configure:6024: test -z 			 || test ! -s conftest.err
configure:6027: $? = 0
configure:6030: test -s conftest.o
configure:6033: $? = 0
configure:6044: result: yes
configure:5999: checking for inttypes.h
configure:6015: gcc -c -g -O2  conftest.c >&5
configure:6021: $? = 0
configure:6024: test -z 			 || test ! -s conftest.err
configure:6027: $? = 0
configure:6030: test -s conftest.o
configure:6033: $? = 0
configure:6044: result: yes
configure:5999: checking for stdint.h
configure:6015: gcc -c -g -O2  conftest.c >&5
configure:6021: $? = 0
configure:6024: test -z 			 || test ! -s conftest.err
configure:6027: $? = 0
configure:6030: test -s conftest.o
configure:6033: $? = 0
configure:6044: result: yes
configure:5999: checking for unistd.h
configure:6015: gcc -c -g -O2  conftest.c >&5
configure:6021: $? = 0
configure:6024: test -z 			 || test ! -s conftest.err
configure:6027: $? = 0
configure:6030: test -s conftest.o
configure:6033: $? = 0
configure:6044: result: yes
configure:6070: checking dlfcn.h usability
configure:6082: gcc -c -g -O2  conftest.c >&5
configure:6088: $? = 0
configure:6091: test -z 			 || test ! -s conftest.err
configure:6094: $? = 0
configure:6097: test -s conftest.o
configure:6100: $? = 0
configure:6110: result: yes
configure:6114: checking dlfcn.h presence
configure:6124: gcc -E  conftest.c
configure:6130: $? = 0
configure:6150: result: yes
configure:6185: checking for dlfcn.h
configure:6192: result: yes
configure:6257: checking for g++
configure:6273: found /usr/bin/g++
configure:6283: result: g++
configure:6299: checking for C++ compiler version
configure:6302: g++ --version </dev/null >&5
g++ (GCC) 4.1.1 20060724 (prerelease) (4.1.1-3mdk)
Copyright (C) 2006 Free Software Foundation, Inc.
This is free software; see the source for copying conditions.  There is NO
warranty; not even for MERCHANTABILITY or FITNESS FOR A PARTICULAR PURPOSE.

configure:6305: $? = 0
configure:6307: g++ -v </dev/null >&5
Using built-in specs.
Target: i586-mandriva-linux-gnu
Configured with: ../configure --prefix=/usr --libexecdir=/usr/lib --with-slibdir=/lib --mandir=/usr/share/man --infodir=/usr/share/info --enable-shared --enable-threads=posix --enable-checking=release --enable-languages=c,c++,ada,fortran,objc,obj-c++,java --host=i586-mandriva-linux-gnu --with-cpu=generic --with-system-zlib --enable-long-long --enable-__cxa_atexit --enable-clocale=gnu --disable-libunwind-exceptions --enable-java-awt=gtk --with-java-home=/usr/lib/jvm/java-1.4.2-gcj-1.4.2.0/jre --enable-gtk-cairo --enable-ssp --disable-libssp
Thread model: posix
gcc version 4.1.1 20060724 (prerelease) (4.1.1-3mdk)
configure:6310: $? = 0
configure:6312: g++ -V </dev/null >&5
g++: '-V' option must have argument
configure:6315: $? = 1
configure:6318: checking whether we are using the GNU C++ compiler
configure:6342: g++ -c   conftest.cc >&5
configure:6348: $? = 0
configure:6351: test -z 			 || test ! -s conftest.err
configure:6354: $? = 0
configure:6357: test -s conftest.o
configure:6360: $? = 0
configure:6373: result: yes
configure:6379: checking whether g++ accepts -g
configure:6400: g++ -c -g  conftest.cc >&5
configure:6406: $? = 0
configure:6409: test -z 			 || test ! -s conftest.err
configure:6412: $? = 0
configure:6415: test -s conftest.o
configure:6418: $? = 0
configure:6429: result: yes
configure:6471: g++ -c -g -O2  conftest.cc >&5
configure:6477: $? = 0
configure:6480: test -z 			 || test ! -s conftest.err
configure:6483: $? = 0
configure:6486: test -s conftest.o
configure:6489: $? = 0
configure:6515: g++ -c -g -O2  conftest.cc >&5
conftest.cc: In function 'int main()':
conftest.cc:26: error: 'exit' was not declared in this scope
configure:6521: $? = 1
configure: failed program was:
| /* confdefs.h.  */
| 
| #define PACKAGE_NAME "gnumeric"
| #define PACKAGE_TARNAME "gnumeric"
| #define PACKAGE_VERSION "1.6.0"
| #define PACKAGE_STRING "gnumeric 1.6.0"
| #define PACKAGE_BUGREPORT "http://bugzilla.gnome.org/enter_bug.cgi?product=gnumeric"
| #define PACKAGE "gnumeric"
| #define VERSION "1.6.0"
| #define STDC_HEADERS 1
| #define HAVE_SYS_TYPES_H 1
| #define HAVE_SYS_STAT_H 1
| #define HAVE_STDLIB_H 1
| #define HAVE_STRING_H 1
| #define HAVE_MEMORY_H 1
| #define HAVE_STRINGS_H 1
| #define HAVE_INTTYPES_H 1
| #define HAVE_STDINT_H 1
| #define HAVE_UNISTD_H 1
| #define HAVE_DLFCN_H 1
| /* end confdefs.h.  */
| 
| int
| main ()
| {
| exit (42);
|   ;
|   return 0;
| }
configure:6471: g++ -c -g -O2  conftest.cc >&5
configure:6477: $? = 0
configure:6480: test -z 			 || test ! -s conftest.err
configure:6483: $? = 0
configure:6486: test -s conftest.o
configure:6489: $? = 0
configure:6515: g++ -c -g -O2  conftest.cc >&5
configure:6521: $? = 0
configure:6524: test -z 			 || test ! -s conftest.err
configure:6527: $? = 0
configure:6530: test -s conftest.o
configure:6533: $? = 0
configure:6558: checking dependency style of g++
configure:6648: result: gcc3
configure:6675: checking how to run the C++ preprocessor
configure:6706: g++ -E  conftest.cc
configure:6712: $? = 0
configure:6744: g++ -E  conftest.cc
conftest.cc:25:28: error: ac_nonexistent.h: No such file or directory
configure:6750: $? = 1
configure: failed program was:
| /* confdefs.h.  */
| 
| #define PACKAGE_NAME "gnumeric"
| #define PACKAGE_TARNAME "gnumeric"
| #define PACKAGE_VERSION "1.6.0"
| #define PACKAGE_STRING "gnumeric 1.6.0"
| #define PACKAGE_BUGREPORT "http://bugzilla.gnome.org/enter_bug.cgi?product=gnumeric"
| #define PACKAGE "gnumeric"
| #define VERSION "1.6.0"
| #define STDC_HEADERS 1
| #define HAVE_SYS_TYPES_H 1
| #define HAVE_SYS_STAT_H 1
| #define HAVE_STDLIB_H 1
| #define HAVE_STRING_H 1
| #define HAVE_MEMORY_H 1
| #define HAVE_STRINGS_H 1
| #define HAVE_INTTYPES_H 1
| #define HAVE_STDINT_H 1
| #define HAVE_UNISTD_H 1
| #define HAVE_DLFCN_H 1
| #ifdef __cplusplus
| extern "C" void std::exit (int) throw (); using std::exit;
| #endif
| /* end confdefs.h.  */
| #include <ac_nonexistent.h>
configure:6789: result: g++ -E
configure:6813: g++ -E  conftest.cc
configure:6819: $? = 0
configure:6851: g++ -E  conftest.cc
conftest.cc:25:28: error: ac_nonexistent.h: No such file or directory
configure:6857: $? = 1
configure: failed program was:
| /* confdefs.h.  */
| 
| #define PACKAGE_NAME "gnumeric"
| #define PACKAGE_TARNAME "gnumeric"
| #define PACKAGE_VERSION "1.6.0"
| #define PACKAGE_STRING "gnumeric 1.6.0"
| #define PACKAGE_BUGREPORT "http://bugzilla.gnome.org/enter_bug.cgi?product=gnumeric"
| #define PACKAGE "gnumeric"
| #define VERSION "1.6.0"
| #define STDC_HEADERS 1
| #define HAVE_SYS_TYPES_H 1
| #define HAVE_SYS_STAT_H 1
| #define HAVE_STDLIB_H 1
| #define HAVE_STRING_H 1
| #define HAVE_MEMORY_H 1
| #define HAVE_STRINGS_H 1
| #define HAVE_INTTYPES_H 1
| #define HAVE_STDINT_H 1
| #define HAVE_UNISTD_H 1
| #define HAVE_DLFCN_H 1
| #ifdef __cplusplus
| extern "C" void std::exit (int) throw (); using std::exit;
| #endif
| /* end confdefs.h.  */
| #include <ac_nonexistent.h>
configure:6954: checking for g77
configure:6983: result: no
configure:6954: checking for f77
configure:6983: result: no
configure:6954: checking for xlf
configure:6983: result: no
configure:6954: checking for frt
configure:6983: result: no
configure:6954: checking for pgf77
configure:6983: result: no
configure:6954: checking for fort77
configure:6983: result: no
configure:6954: checking for fl32
configure:6983: result: no
configure:6954: checking for af77
configure:6983: result: no
configure:6954: checking for f90
configure:6983: result: no
configure:6954: checking for xlf90
configure:6983: result: no
configure:6954: checking for pgf90
configure:6983: result: no
configure:6954: checking for epcf90
configure:6983: result: no
configure:6954: checking for f95
configure:6983: result: no
configure:6954: checking for fort
configure:6983: result: no
configure:6954: checking for xlf95
configure:6983: result: no
configure:6954: checking for ifc
configure:6983: result: no
configure:6954: checking for efc
configure:6983: result: no
configure:6954: checking for pgf95
configure:6983: result: no
configure:6954: checking for lf95
configure:6983: result: no
configure:6954: checking for gfortran
configure:6983: result: no
configure:6995: checking for Fortran 77 compiler version
configure:6998:  --version </dev/null >&5
./configure: line 6999: --version: command not found
configure:7001: $? = 127
configure:7003:  -v </dev/null >&5
./configure: line 7004: -v: command not found
configure:7006: $? = 127
configure:7008:  -V </dev/null >&5
./configure: line 7009: -V: command not found
configure:7011: $? = 127
configure:7019: checking whether we are using the GNU Fortran 77 compiler
configure:7033:  -c  conftest.F >&5
./configure: line 7034: -c: command not found
configure:7039: $? = 127
configure: failed program was:
|       program main
| #ifndef __GNUC__
|        choke me
| #endif
| 
|       end
configure:7064: result: no
configure:7070: checking whether  accepts -g
configure:7082:  -c -g conftest.f >&5
./configure: line 7083: -c: command not found
configure:7088: $? = 127
configure: failed program was:
|       program main
| 
|       end
configure:7112: result: no
configure:7142: checking the maximum length of command line arguments
configure:7234: result: 32768
configure:7245: checking command to parse /usr/bin/nm -B output from gcc object
configure:7341: gcc -c -g -O2  conftest.c >&5
configure:7344: $? = 0
configure:7348: /usr/bin/nm -B conftest.o \| sed -n -e 's/^.*[ 	]\([ABCDGIRSTW][ABCDGIRSTW]*\)[ 	][ 	]*\([_A-Za-z][_A-Za-z0-9]*\)$/\1 \2 \2/p' \> conftest.nm
configure:7351: $? = 0
configure:7403: gcc -o conftest -g -O2   conftest.c conftstm.o >&5
configure:7406: $? = 0
configure:7444: result: ok
configure:7448: checking for objdir
configure:7463: result: .libs
configure:7553: checking for ar
configure:7569: found /usr/bin/ar
configure:7580: result: ar
configure:7633: checking for ranlib
configure:7649: found /usr/bin/ranlib
configure:7660: result: ranlib
configure:7713: checking for strip
configure:7729: found /usr/bin/strip
configure:7740: result: strip
configure:8027: checking if gcc static flag  works
configure:8055: result: yes
configure:8073: checking if gcc supports -fno-rtti -fno-exceptions
configure:8091: gcc -c -g -O2  -fno-rtti -fno-exceptions conftest.c >&5
cc1: warning: command line option "-fno-rtti" is valid for C++/ObjC++ but not for C
configure:8095: $? = 0
configure:8108: result: no
configure:8123: checking for gcc option to produce PIC
configure:8327: result: -fPIC
configure:8335: checking if gcc PIC flag -fPIC works
configure:8353: gcc -c -g -O2  -fPIC -DPIC conftest.c >&5
configure:8357: $? = 0
configure:8370: result: yes
configure:8394: checking if gcc supports -c -o file.o
configure:8415: gcc -c -g -O2  -o out/conftest2.o conftest.c >&5
configure:8419: $? = 0
configure:8441: result: yes
configure:8467: checking whether the gcc linker (/usr/bin/ld) supports shared libraries
configure:9362: result: yes
configure:9388: checking whether -lc should be explicitly linked in
configure:9393: gcc -c -g -O2  conftest.c >&5
configure:9396: $? = 0
configure:9410: gcc -shared conftest.o  -v -Wl,-soname -Wl,conftest -o conftest 2\>\&1 \| grep  -lc  \>/dev/null 2\>\&1
configure:9413: $? = 0
configure:9425: result: no
configure:9433: checking dynamic linker characteristics
configure:9999: result: GNU/Linux ld.so
configure:10003: checking how to hardcode library paths into programs
configure:10028: result: immediate
configure:10042: checking whether stripping libraries is possible
configure:10047: result: yes
configure:10870: checking if libtool supports shared libraries
configure:10872: result: yes
configure:10875: checking whether to build shared libraries
configure:10896: result: yes
configure:10899: checking whether to build static libraries
configure:10903: result: no
configure:10995: creating libtool
configure:11573: checking for ld used by g++
configure:11640: result: /usr/bin/ld
configure:11649: checking if the linker (/usr/bin/ld) is GNU ld
configure:11664: result: yes
configure:11715: checking whether the g++ linker (/usr/bin/ld) supports shared libraries
configure:12593: result: yes
configure:12611: g++ -c -g -O2  conftest.cpp >&5
configure:12614: $? = 0
configure:12724: checking for g++ option to produce PIC
configure:12992: result: -fPIC
configure:13000: checking if g++ PIC flag -fPIC works
configure:13018: g++ -c -g -O2  -fPIC -DPIC conftest.cpp >&5
configure:13022: $? = 0
configure:13035: result: yes
configure:13059: checking if g++ supports -c -o file.o
configure:13080: g++ -c -g -O2  -o out/conftest2.o conftest.cpp >&5
configure:13084: $? = 0
configure:13106: result: yes
configure:13132: checking whether the g++ linker (/usr/bin/ld) supports shared libraries
configure:13160: result: yes
configure:13231: checking dynamic linker characteristics
configure:13797: result: GNU/Linux ld.so
configure:13801: checking how to hardcode library paths into programs
configure:13826: result: immediate
configure:13840: checking whether stripping libraries is possible
configure:13845: result: yes
configure:21375: checking for ANSI C header files
configure:21530: result: yes
configure:21597: checking zlib.h usability
configure:21609: gcc -c -g -O2  conftest.c >&5
configure:21615: $? = 0
configure:21618: test -z 			 || test ! -s conftest.err
configure:21621: $? = 0
configure:21624: test -s conftest.o
configure:21627: $? = 0
configure:21637: result: yes
configure:21641: checking zlib.h presence
configure:21651: gcc -E  conftest.c
configure:21657: $? = 0
configure:21677: result: yes
configure:21712: checking for zlib.h
configure:21719: result: yes
configure:21724: checking for gzread in -lz
configure:21754: gcc -o conftest -g -O2   conftest.c -lz   >&5
configure:21760: $? = 0
configure:21763: test -z 			 || test ! -s conftest.err
configure:21766: $? = 0
configure:21769: test -s conftest
configure:21772: $? = 0
configure:21785: result: yes
configure:21865: checking for pkg-config
configure:21883: found /usr/bin/pkg-config
configure:21895: result: /usr/bin/pkg-config
configure:21910: checking pkg-config is at least version 0.9.0
configure:21913: result: yes
configure:21965: checking for GTK
configure:21970: $PKG_CONFIG --exists --print-errors "$gnumeric_gtk_reqs"
configure:21973: $? = 0
configure:21984: $PKG_CONFIG --exists --print-errors "$gnumeric_gtk_reqs"
configure:21987: $? = 0
configure:22042: result: yes
configure:22072: checking for GNOME
configure:22077: $PKG_CONFIG --exists --print-errors "$gnumeric_gnome_reqs"
configure:22080: $? = 0
configure:22091: $PKG_CONFIG --exists --print-errors "$gnumeric_gnome_reqs"
configure:22094: $? = 0
configure:22115: result: yes
configure:22154: checking for GNUMERIC
configure:22159: $PKG_CONFIG --exists --print-errors "$gnumeric_reqs"
Package libgoffice-1 was not found in the pkg-config search path.
Perhaps you should add the directory containing `libgoffice-1.pc'
to the PKG_CONFIG_PATH environment variable
No package 'libgoffice-1' found
configure:22162: $? = 1
configure:22173: $PKG_CONFIG --exists --print-errors "$gnumeric_reqs"
Package libgoffice-1 was not found in the pkg-config search path.
Perhaps you should add the directory containing `libgoffice-1.pc'
to the PKG_CONFIG_PATH environment variable
No package 'libgoffice-1' found
configure:22176: $? = 1
Package libgoffice-1 was not found in the pkg-config search path.
Perhaps you should add the directory containing `libgoffice-1.pc'
to the PKG_CONFIG_PATH environment variable
No package 'libgoffice-1' found
configure:22197: error: Package requirements (
	glib-2.0		>= 2.6.0
	gobject-2.0		>= 2.6.0
	gmodule-2.0		>= 2.6.0
	libgsf-1		>= 1.13.2
	libgoffice-1		>= 0.1.0
	libxml-2.0		>= 2.4.12
	pango			>= 1.8.1
	pangoft2		>= 1.8.1
 
	gtk+-2.0		>= 2.6.0
	libglade-2.0		>= 2.3.6
	libgnomeprint-2.2	>= 2.8.2
	libgnomeprintui-2.2	>= 2.8.2
	libart-2.0		>= 2.3.11
 
	gconf-2.0
	libbonobo-2.0		>= 2.2.0
	libbonoboui-2.0		>= 2.2.0
	libgnome-2.0		>= 2.0.0
	libgnomeui-2.0		>= 2.0.0
	libgsf-gnome-1		>= 1.12.1
) were not met.
Consider adjusting the PKG_CONFIG_PATH environment variable if you
installed software in a non-standard prefix.

Alternatively you may set the GNUMERIC_CFLAGS and GNUMERIC_LIBS environment variables
to avoid the need to call pkg-config.  See the pkg-config man page for
more details.

## ---------------- ##
## Cache variables. ##
## ---------------- ##

ac_cv_build=i686-pc-linux-gnu
ac_cv_build_alias=i686-pc-linux-gnu
ac_cv_c_compiler_gnu=yes
ac_cv_cxx_compiler_gnu=yes
ac_cv_env_CC_set=
ac_cv_env_CC_value=
ac_cv_env_CFLAGS_set=
ac_cv_env_CFLAGS_value=
ac_cv_env_CORBA_LIBS_CFLAGS_set=
ac_cv_env_CORBA_LIBS_CFLAGS_value=
ac_cv_env_CORBA_LIBS_LIBS_set=
ac_cv_env_CORBA_LIBS_LIBS_value=
ac_cv_env_CPPFLAGS_set=
ac_cv_env_CPPFLAGS_value=
ac_cv_env_CPP_set=
ac_cv_env_CPP_value=
ac_cv_env_CXXCPP_set=
ac_cv_env_CXXCPP_value=
ac_cv_env_CXXFLAGS_set=
ac_cv_env_CXXFLAGS_value=
ac_cv_env_CXX_set=
ac_cv_env_CXX_value=
ac_cv_env_F77_set=
ac_cv_env_F77_value=
ac_cv_env_FFLAGS_set=
ac_cv_env_FFLAGS_value=
ac_cv_env_GB_CFLAGS_set=
ac_cv_env_GB_CFLAGS_value=
ac_cv_env_GB_LIBS_set=
ac_cv_env_GB_LIBS_value=
ac_cv_env_GDA_CFLAGS_set=
ac_cv_env_GDA_CFLAGS_value=
ac_cv_env_GDA_LIBS_set=
ac_cv_env_GDA_LIBS_value=
ac_cv_env_GDK_PIXBUF_CSOURCE_set=
ac_cv_env_GDK_PIXBUF_CSOURCE_value=
ac_cv_env_GLIB_GENMARSHAL_set=
ac_cv_env_GLIB_GENMARSHAL_value=
ac_cv_env_GNOMEDB_CFLAGS_set=
ac_cv_env_GNOMEDB_CFLAGS_value=
ac_cv_env_GNOMEDB_LIBS_set=
ac_cv_env_GNOMEDB_LIBS_value=
ac_cv_env_GNOME_CFLAGS_set=
ac_cv_env_GNOME_CFLAGS_value=
ac_cv_env_GNOME_LIBS_set=
ac_cv_env_GNOME_LIBS_value=
ac_cv_env_GNUMERIC_CFLAGS_set=
ac_cv_env_GNUMERIC_CFLAGS_value=
ac_cv_env_GNUMERIC_LIBS_set=
ac_cv_env_GNUMERIC_LIBS_value=
ac_cv_env_GTK_CFLAGS_set=
ac_cv_env_GTK_CFLAGS_value=
ac_cv_env_GTK_LIBS_set=
ac_cv_env_GTK_LIBS_value=
ac_cv_env_HILDON_CFLAGS_set=
ac_cv_env_HILDON_CFLAGS_value=
ac_cv_env_HILDON_LIBS_set=
ac_cv_env_HILDON_LIBS_value=
ac_cv_env_LDFLAGS_set=
ac_cv_env_LDFLAGS_value=
ac_cv_env_PARADOX_CFLAGS_set=
ac_cv_env_PARADOX_CFLAGS_value=
ac_cv_env_PARADOX_LIBS_set=
ac_cv_env_PARADOX_LIBS_value=
ac_cv_env_PERL_set=
ac_cv_env_PERL_value=
ac_cv_env_PKG_CONFIG_set=
ac_cv_env_PKG_CONFIG_value=
ac_cv_env_PSICONV_CONFIG_set=
ac_cv_env_PSICONV_CONFIG_value=
ac_cv_env_PYGTK_CFLAGS_set=
ac_cv_env_PYGTK_CFLAGS_value=
ac_cv_env_PYGTK_LIBS_set=
ac_cv_env_PYGTK_LIBS_value=
ac_cv_env_PYTHON_set=
ac_cv_env_PYTHON_value=
ac_cv_env_WINDRES_set=
ac_cv_env_WINDRES_value=
ac_cv_env_build_alias_set=
ac_cv_env_build_alias_value=
ac_cv_env_host_alias_set=
ac_cv_env_host_alias_value=
ac_cv_env_target_alias_set=
ac_cv_env_target_alias_value=
ac_cv_exeext=
ac_cv_f77_compiler_gnu=no
ac_cv_header_dlfcn_h=yes
ac_cv_header_inttypes_h=yes
ac_cv_header_memory_h=yes
ac_cv_header_stdc=yes
ac_cv_header_stdint_h=yes
ac_cv_header_stdlib_h=yes
ac_cv_header_string_h=yes
ac_cv_header_strings_h=yes
ac_cv_header_sys_stat_h=yes
ac_cv_header_sys_types_h=yes
ac_cv_header_unistd_h=yes
ac_cv_header_zlib_h=yes
ac_cv_host=i686-pc-linux-gnu
ac_cv_host_alias=i686-pc-linux-gnu
ac_cv_lib_fl_yywrap=no
ac_cv_lib_l_yywrap=no
ac_cv_lib_z_gzread=yes
ac_cv_objext=o
ac_cv_path_INTLTOOL_ICONV=/usr/bin/iconv
ac_cv_path_INTLTOOL_MSGFMT=msgfmt
ac_cv_path_INTLTOOL_MSGMERGE=msgmerge
ac_cv_path_INTLTOOL_PERL=/usr/bin/perl
ac_cv_path_INTLTOOL_XGETTEXT=xgettext
ac_cv_path_ac_pt_PKG_CONFIG=/usr/bin/pkg-config
ac_cv_path_install='/usr/bin/install -c'
ac_cv_prog_AWK=gawk
ac_cv_prog_CPP='gcc -E'
ac_cv_prog_CXXCPP='g++ -E'
ac_cv_prog_ac_ct_AR=ar
ac_cv_prog_ac_ct_CC=gcc
ac_cv_prog_ac_ct_CXX=g++
ac_cv_prog_ac_ct_RANLIB=ranlib
ac_cv_prog_ac_ct_STRIP=strip
ac_cv_prog_cc_g=yes
ac_cv_prog_cc_stdc=
ac_cv_prog_cxx_g=yes
ac_cv_prog_egrep='grep -E'
ac_cv_prog_f77_g=no
ac_cv_prog_make_make_set=yes
ac_cv_search_strerror='none required'
am_cv_CC_dependencies_compiler_type=gcc3
am_cv_CXX_dependencies_compiler_type=gcc3
lt_cv_deplibs_check_method=pass_all
lt_cv_file_magic_cmd='$MAGIC_CMD'
lt_cv_file_magic_test_file=
lt_cv_ld_reload_flag=-r
lt_cv_objdir=.libs
lt_cv_path_LD=/usr/bin/ld
lt_cv_path_LDCXX=/usr/bin/ld
lt_cv_path_NM='/usr/bin/nm -B'
lt_cv_path_SED=/bin/sed
lt_cv_prog_compiler_c_o=yes
lt_cv_prog_compiler_c_o_CXX=yes
lt_cv_prog_compiler_rtti_exceptions=no
lt_cv_prog_gnu_ld=yes
lt_cv_prog_gnu_ldcxx=yes
lt_cv_sys_global_symbol_pipe='sed -n -e '\''s/^.*[ 	]\([ABCDGIRSTW][ABCDGIRSTW]*\)[ 	][ 	]*\([_A-Za-z][_A-Za-z0-9]*\)$/\1 \2 \2/p'\'''
lt_cv_sys_global_symbol_to_c_name_address='sed -n -e '\''s/^: \([^ ]*\) $/  {\"\1\", (lt_ptr) 0},/p'\'' -e '\''s/^[BCDEGRST] \([^ ]*\) \([^ ]*\)$/  {"\2", (lt_ptr) \&\2},/p'\'''
lt_cv_sys_global_symbol_to_cdecl='sed -n -e '\''s/^. .* \(.*\)$/extern int \1;/p'\'''
lt_cv_sys_max_cmd_len=32768
lt_lt_cv_prog_compiler_c_o='"yes"'
lt_lt_cv_prog_compiler_c_o_CXX='"yes"'
lt_lt_cv_sys_global_symbol_pipe='"sed -n -e '\''s/^.*[ 	]\\([ABCDGIRSTW][ABCDGIRSTW]*\\)[ 	][ 	]*\\([_A-Za-z][_A-Za-z0-9]*\\)\$/\\1 \\2 \\2/p'\''"'
lt_lt_cv_sys_global_symbol_to_c_name_address='"sed -n -e '\''s/^: \\([^ ]*\\) \$/  {\\\"\\1\\\", (lt_ptr) 0},/p'\'' -e '\''s/^[BCDEGRST] \\([^ ]*\\) \\([^ ]*\\)\$/  {\"\\2\", (lt_ptr) \\&\\2},/p'\''"'
lt_lt_cv_sys_global_symbol_to_cdecl='"sed -n -e '\''s/^. .* \\(.*\\)\$/extern int \\1;/p'\''"'
pkg_cv_GNOME_CFLAGS='-DORBIT2=1 -pthread -I/usr/include/gconf/2 -I/usr/include/orbit-2.0 -I/usr/include/glib-2.0 -I/usr/lib/glib-2.0/include -I/usr/include/libbonobo-2.0 -I/usr/include/bonobo-activation-2.0 -I/usr/include/libbonoboui-2.0 -I/usr/include/libxml2 -I/usr/include/libgnomecanvas-2.0 -I/usr/include/libgnome-2.0 -I/usr/include/libart-2.0 -I/usr/include/pango-1.0 -I/usr/include/freetype2 -I/usr/include/gtk-2.0 -I/usr/lib/gtk-2.0/include -I/usr/include/atk-1.0 -I/usr/include/cairo -I/usr/include/gnome-vfs-2.0 -I/usr/lib/gnome-vfs-2.0/include -I/usr/include/libgnomeui-2.0 -I/usr/include/gnome-keyring-1 -I/usr/include/libgsf-1 -I/usr/include/gnome-vfs-module-2.0  '
pkg_cv_GNOME_LIBS='-pthread -lgnomeui-2 -lSM -lICE -lbonoboui-2 -lgnome-keyring -lgnomecanvas-2 -lgnome-2 -lpopt -lart_lgpl_2 -lpangoft2-1.0 -lgtk-x11-2.0 -lgdk-x11-2.0 -latk-1.0 -lgdk_pixbuf-2.0 -lpangocairo-1.0 -lpango-1.0 -lcairo -lgsf-gnome-1 -lgsf-1 -lbonobo-2 -lgnomevfs-2 -lxml2 -lz -lbonobo-activation -lgconf-2 -lgobject-2.0 -lORBit-2 -lm -lgmodule-2.0 -ldl -lgthread-2.0 -lglib-2.0  '
pkg_cv_GTK_CFLAGS='-I/usr/include/gtk-2.0 -I/usr/lib/gtk-2.0/include -I/usr/include/atk-1.0 -I/usr/include/cairo -I/usr/include/pango-1.0 -I/usr/include/glib-2.0 -I/usr/lib/glib-2.0/include -I/usr/include/libglade-2.0 -I/usr/include/libxml2 -I/usr/include/libgnomeprint-2.2 -I/usr/include/libart-2.0 -I/usr/include/libgnomeprintui-2.2 -I/usr/include/libgnomecanvas-2.0 -I/usr/include/freetype2  '
pkg_cv_GTK_LIBS='-Wl,--export-dynamic -lglade-2.0 -lgnomeprintui-2-2 -lgnomeprint-2-2 -lgnomecanvas-2 -lxml2 -lz -lpangoft2-1.0 -lgtk-x11-2.0 -lgdk-x11-2.0 -latk-1.0 -lgdk_pixbuf-2.0 -lm -lpangocairo-1.0 -lpango-1.0 -lcairo -lgobject-2.0 -lgmodule-2.0 -ldl -lglib-2.0 -lart_lgpl_2  '

## ----------------- ##
## Output variables. ##
## ----------------- ##

ACLOCAL='${SHELL} /home/apps/gnumeric-1.6.0/missing --run aclocal-1.8'
ACLOCAL_AMFLAGS=''
ALL_LINGUAS=''
AMDEPBACKSLASH='\'
AMDEP_FALSE='#'
AMDEP_TRUE=''
AMTAR='${SHELL} /home/apps/gnumeric-1.6.0/missing --run tar'
AR='ar'
AUTOCONF='${SHELL} /home/apps/gnumeric-1.6.0/missing --run autoconf'
AUTOHEADER='${SHELL} /home/apps/gnumeric-1.6.0/missing --run autoheader'
AUTOMAKE='${SHELL} /home/apps/gnumeric-1.6.0/missing --run automake-1.8'
AWK='gawk'
CATALOGS=''
CATOBJEXT=''
CC='gcc'
CCDEPMODE='depmode=gcc3'
CFLAGS='-g -O2'
CORBA_LIBS_CFLAGS=''
CORBA_LIBS_LIBS=''
CPP='gcc -E'
CPPFLAGS=''
CROSS_COMPILING_FALSE=''
CROSS_COMPILING_TRUE=''
CXX='g++'
CXXCPP='g++ -E'
CXXDEPMODE='depmode=gcc3'
CXXFLAGS='-g -O2'
CYGPATH_W='echo'
DATADIRNAME=''
DEFS=''
DEPDIR='.deps'
ECHO='echo'
ECHO_C=''
ECHO_N='-n'
ECHO_T=''
EGREP='grep -E'
ENABLE_SOLVER_FALSE=''
ENABLE_SOLVER_TRUE=''
ENABLE_SSCONVERT_FALSE=''
ENABLE_SSCONVERT_TRUE=''
ENABLE_SSINDEX_FALSE=''
ENABLE_SSINDEX_TRUE=''
EXEEXT=''
F77=''
FFLAGS=''
GB_CFLAGS=''
GB_LIBS=''
GCONFTOOL=''
GCONF_SCHEMAS_INSTALL_FALSE=''
GCONF_SCHEMAS_INSTALL_TRUE=''
GCONF_SCHEMA_CONFIG_SOURCE=''
GCONF_SCHEMA_FILE_DIR=''
GDA_CFLAGS=''
GDA_LIBS=''
GDK_PIXBUF_CSOURCE=''
GETTEXT_PACKAGE=''
GLIB_GENMARSHAL=''
GMOFILES=''
GMSGFMT=''
GNOMEDB_CFLAGS=''
GNOMEDB_LIBS=''
GNOME_CFLAGS='-DORBIT2=1 -pthread -I/usr/include/gconf/2 -I/usr/include/orbit-2.0 -I/usr/include/glib-2.0 -I/usr/lib/glib-2.0/include -I/usr/include/libbonobo-2.0 -I/usr/include/bonobo-activation-2.0 -I/usr/include/libbonoboui-2.0 -I/usr/include/libxml2 -I/usr/include/libgnomecanvas-2.0 -I/usr/include/libgnome-2.0 -I/usr/include/libart-2.0 -I/usr/include/pango-1.0 -I/usr/include/freetype2 -I/usr/include/gtk-2.0 -I/usr/lib/gtk-2.0/include -I/usr/include/atk-1.0 -I/usr/include/cairo -I/usr/include/gnome-vfs-2.0 -I/usr/lib/gnome-vfs-2.0/include -I/usr/include/libgnomeui-2.0 -I/usr/include/gnome-keyring-1 -I/usr/include/libgsf-1 -I/usr/include/gnome-vfs-module-2.0  '
GNOME_LIBS='-pthread -lgnomeui-2 -lSM -lICE -lbonoboui-2 -lgnome-keyring -lgnomecanvas-2 -lgnome-2 -lpopt -lart_lgpl_2 -lpangoft2-1.0 -lgtk-x11-2.0 -lgdk-x11-2.0 -latk-1.0 -lgdk_pixbuf-2.0 -lpangocairo-1.0 -lpango-1.0 -lcairo -lgsf-gnome-1 -lgsf-1 -lbonobo-2 -lgnomevfs-2 -lxml2 -lz -lbonobo-activation -lgconf-2 -lgobject-2.0 -lORBit-2 -lm -lgmodule-2.0 -ldl -lgthread-2.0 -lglib-2.0  '
GNUMERIC_CFLAGS=''
GNUMERIC_LIBS=''
GNUMERIC_PLUGIN_LDFLAGS=''
GTK_CFLAGS='-I/usr/include/gtk-2.0 -I/usr/lib/gtk-2.0/include -I/usr/include/atk-1.0 -I/usr/include/cairo -I/usr/include/pango-1.0 -I/usr/include/glib-2.0 -I/usr/lib/glib-2.0/include -I/usr/include/libglade-2.0 -I/usr/include/libxml2 -I/usr/include/libgnomeprint-2.2 -I/usr/include/libart-2.0 -I/usr/include/libgnomeprintui-2.2 -I/usr/include/libgnomecanvas-2.0 -I/usr/include/freetype2  '
GTK_LIBS='-Wl,--export-dynamic -lglade-2.0 -lgnomeprintui-2-2 -lgnomeprint-2-2 -lgnomecanvas-2 -lxml2 -lz -lpangoft2-1.0 -lgtk-x11-2.0 -lgdk-x11-2.0 -latk-1.0 -lgdk_pixbuf-2.0 -lm -lpangocairo-1.0 -lpango-1.0 -lcairo -lgobject-2.0 -lgmodule-2.0 -ldl -lglib-2.0 -lart_lgpl_2  '
GUILE_INCS=''
GUILE_LIBS=''
HILDON_CFLAGS=''
HILDON_LIBS=''
INSTALL_DATA='${INSTALL} -m 644'
INSTALL_PROGRAM='${INSTALL}'
INSTALL_SCRIPT='${INSTALL}'
INSTALL_STRIP_PROGRAM='${SHELL} $(install_sh) -c -s'
INSTOBJEXT=''
INTLLIBS=''
INTLTOOL_CAVES_RULE='%.caves:     %.caves.in     $(INTLTOOL_MERGE) $(wildcard $(top_srcdir)/po/*.po) ; LC_ALL=C $(INTLTOOL_MERGE) -d -u -c $(top_builddir)/po/.intltool-merge-cache $(top_srcdir)/po $< $@'
INTLTOOL_DESKTOP_RULE='%.desktop:   %.desktop.in   $(INTLTOOL_MERGE) $(wildcard $(top_srcdir)/po/*.po) ; LC_ALL=C $(INTLTOOL_MERGE) -d -u -c $(top_builddir)/po/.intltool-merge-cache $(top_srcdir)/po $< $@'
INTLTOOL_DIRECTORY_RULE='%.directory: %.directory.in $(INTLTOOL_MERGE) $(wildcard $(top_srcdir)/po/*.po) ; LC_ALL=C $(INTLTOOL_MERGE) -d -u -c $(top_builddir)/po/.intltool-merge-cache $(top_srcdir)/po $< $@'
INTLTOOL_EXTRACT='$(top_builddir)/intltool-extract'
INTLTOOL_ICONV='/usr/bin/iconv'
INTLTOOL_KBD_RULE='%.kbd:       %.kbd.in       $(INTLTOOL_MERGE) $(wildcard $(top_srcdir)/po/*.po) ; LC_ALL=C $(INTLTOOL_MERGE) -x -u -m -c $(top_builddir)/po/.intltool-merge-cache $(top_srcdir)/po $< $@'
INTLTOOL_KEYS_RULE='%.keys:      %.keys.in      $(INTLTOOL_MERGE) $(wildcard $(top_srcdir)/po/*.po) ; LC_ALL=C $(INTLTOOL_MERGE) -k -u -c $(top_builddir)/po/.intltool-merge-cache $(top_srcdir)/po $< $@'
INTLTOOL_MERGE='$(top_builddir)/intltool-merge'
INTLTOOL_MSGFMT='msgfmt'
INTLTOOL_MSGMERGE='msgmerge'
INTLTOOL_OAF_RULE='%.oaf:       %.oaf.in       $(INTLTOOL_MERGE) $(wildcard $(top_srcdir)/po/*.po) ; LC_ALL=C $(INTLTOOL_MERGE) -o -p $(top_srcdir)/po $< $@'
INTLTOOL_PERL='/usr/bin/perl'
INTLTOOL_PONG_RULE='%.pong:      %.pong.in      $(INTLTOOL_MERGE) $(wildcard $(top_srcdir)/po/*.po) ; LC_ALL=C $(INTLTOOL_MERGE) -x -u -c $(top_builddir)/po/.intltool-merge-cache $(top_srcdir)/po $< $@'
INTLTOOL_PROP_RULE='%.prop:      %.prop.in      $(INTLTOOL_MERGE) $(wildcard $(top_srcdir)/po/*.po) ; LC_ALL=C $(INTLTOOL_MERGE) -d -u -c $(top_builddir)/po/.intltool-merge-cache $(top_srcdir)/po $< $@'
INTLTOOL_SCHEMAS_RULE='%.schemas:   %.schemas.in   $(INTLTOOL_MERGE) $(wildcard $(top_srcdir)/po/*.po) ; LC_ALL=C $(INTLTOOL_MERGE) -s -u -c $(top_builddir)/po/.intltool-merge-cache $(top_srcdir)/po $< $@'
INTLTOOL_SERVER_RULE='%.server:    %.server.in    $(INTLTOOL_MERGE) $(wildcard $(top_srcdir)/po/*.po) ; LC_ALL=C $(INTLTOOL_MERGE) -o -u -c $(top_builddir)/po/.intltool-merge-cache $(top_srcdir)/po $< $@'
INTLTOOL_SHEET_RULE='%.sheet:     %.sheet.in     $(INTLTOOL_MERGE) $(wildcard $(top_srcdir)/po/*.po) ; LC_ALL=C $(INTLTOOL_MERGE) -x -u -c $(top_builddir)/po/.intltool-merge-cache $(top_srcdir)/po $< $@'
INTLTOOL_SOUNDLIST_RULE='%.soundlist: %.soundlist.in $(INTLTOOL_MERGE) $(wildcard $(top_srcdir)/po/*.po) ; LC_ALL=C $(INTLTOOL_MERGE) -d -u -c $(top_builddir)/po/.intltool-merge-cache $(top_srcdir)/po $< $@'
INTLTOOL_THEME_RULE='%.theme:     %.theme.in     $(INTLTOOL_MERGE) $(wildcard $(top_srcdir)/po/*.po) ; LC_ALL=C $(INTLTOOL_MERGE) -d -u -c $(top_builddir)/po/.intltool-merge-cache $(top_srcdir)/po $< $@'
INTLTOOL_UI_RULE='%.ui:        %.ui.in        $(INTLTOOL_MERGE) $(wildcard $(top_srcdir)/po/*.po) ; LC_ALL=C $(INTLTOOL_MERGE) -x -u -c $(top_builddir)/po/.intltool-merge-cache $(top_srcdir)/po $< $@'
INTLTOOL_UPDATE='$(top_builddir)/intltool-update'
INTLTOOL_XAM_RULE='%.xam:       %.xml.in       $(INTLTOOL_MERGE) $(wildcard $(top_srcdir)/po/*.po) ; LC_ALL=C $(INTLTOOL_MERGE) -x -u -c $(top_builddir)/po/.intltool-merge-cache $(top_srcdir)/po $< $@'
INTLTOOL_XGETTEXT='xgettext'
INTLTOOL_XML_NOMERGE_RULE='%.xml:       %.xml.in       $(INTLTOOL_MERGE) ; LC_ALL=C $(INTLTOOL_MERGE) -x -u /tmp $< $@'
INTLTOOL_XML_RULE='%.xml:       %.xml.in       $(INTLTOOL_MERGE) $(wildcard $(top_srcdir)/po/*.po) ; LC_ALL=C $(INTLTOOL_MERGE) -x -u -c $(top_builddir)/po/.intltool-merge-cache $(top_srcdir)/po $< $@'
LDFLAGS=''
LEX='${SHELL} /home/apps/gnumeric-1.6.0/missing --run flex'
LEXLIB=''
LEX_OUTPUT_ROOT=''
LIBOBJS=''
LIBS=''
LIBTOOL='$(SHELL) $(top_builddir)/libtool'
LN_S='ln -s'
LTLIBOBJS=''
MAINT='#'
MAINTAINER_MODE_FALSE=''
MAINTAINER_MODE_TRUE='#'
MAKEINFO='${SHELL} /home/apps/gnumeric-1.6.0/missing --run makeinfo'
MKINSTALLDIRS=''
MSGFMT=''
OBJEXT='o'
ORBIT_IDL=''
PACKAGE='gnumeric'
PACKAGE_BUGREPORT='http://bugzilla.gnome.org/enter_bug.cgi?product=gnumeric'
PACKAGE_NAME='gnumeric'
PACKAGE_STRING='gnumeric 1.6.0'
PACKAGE_TARNAME='gnumeric'
PACKAGE_VERSION='1.6.0'
PARADOX_CFLAGS=''
PARADOX_LIBS=''
PATH_SEPARATOR=':'
PERL=''
PERL_CC=''
PERL_CCCDLFLAGS=''
PERL_CCOPTS=''
PERL_LD=''
PERL_LDDLFLAGS=''
PERL_LDOPTS=''
PKG_CONFIG='/usr/bin/pkg-config'
PLUGIN_LIST=''
PLUGIN_LIST_GIVEN_FALSE=''
PLUGIN_LIST_GIVEN_TRUE=''
POFILES=''
POFILES_FULL=''
POSUB=''
PO_IN_DATADIR_FALSE=''
PO_IN_DATADIR_TRUE=''
PSICONV_CFLAGS=''
PSICONV_CONFIG=''
PSICONV_LIBS=''
PYGTK_CFLAGS=''
PYGTK_LIBS=''
PYTHON=''
PY_CFLAGS=''
PY_EXTRA_LIBS=''
PY_LIBS=''
PY_LIB_LOC=''
RANLIB='ranlib'
SET_MAKE=''
SHELL='/bin/sh'
STRIP='strip'
USE_HILDON_FALSE=''
USE_HILDON_TRUE=''
USE_NLS=''
VERSION='1.6.0'
WARN_CFLAGS=''
WINDRES=''
WITH_CORBA_FALSE=''
WITH_CORBA_TRUE=''
WITH_GB_FALSE=''
WITH_GB_TRUE=''
WITH_GDA_FALSE=''
WITH_GDA_TRUE=''
WITH_GNOMEDB_FALSE=''
WITH_GNOMEDB_TRUE=''
WITH_GNOME_FALSE='#'
WITH_GNOME_TRUE=''
WITH_GTK_FALSE='#'
WITH_GTK_TRUE=''
WITH_HILDON_FALSE=''
WITH_HILDON_TRUE=''
WITH_PARADOX_FALSE=''
WITH_PARADOX_TRUE=''
WITH_PERL_FALSE=''
WITH_PERL_TRUE=''
WITH_PSICONV_FALSE=''
WITH_PSICONV_TRUE=''
WITH_PYTHON_FALSE=''
WITH_PYTHON_TRUE=''
WITH_WIN32_FALSE=''
WITH_WIN32_TRUE=''
XGETTEXT=''
YACC='yacc'
Z_CPPFLAGS=''
Z_LIBS='-lz'
ac_ct_AR='ar'
ac_ct_CC='gcc'
ac_ct_CXX='g++'
ac_ct_F77=''
ac_ct_RANLIB='ranlib'
ac_ct_STRIP='strip'
ac_ct_WINDRES=''
ac_pt_PKG_CONFIG='/usr/bin/pkg-config'
am__fastdepCC_FALSE='#'
am__fastdepCC_TRUE=''
am__fastdepCXX_FALSE='#'
am__fastdepCXX_TRUE=''
am__include='include'
am__leading_dot='.'
am__quote=''
bindir='${exec_prefix}/bin'
build='i686-pc-linux-gnu'
build_alias=''
build_cpu='i686'
build_os='linux-gnu'
build_vendor='pc'
datadir='${prefix}/share'
exec_prefix='NONE'
gnumeric_datadir=''
gnumeric_icondir=''
gnumeric_libdir=''
gnumeric_localedir=''
gnumeric_plugindir=''
host='i686-pc-linux-gnu'
host_alias=''
host_cpu='i686'
host_os='linux-gnu'
host_vendor='pc'
includedir='${prefix}/include'
infodir='${prefix}/info'
install_sh='/home/apps/gnumeric-1.6.0/install-sh'
libdir='${exec_prefix}/lib'
libexecdir='${exec_prefix}/libexec'
localstatedir='${prefix}/var'
mandir='${prefix}/man'
mkdir_p='mkdir -p -- .'
oldincludedir='/usr/include'
prefix='NONE'
program_transform_name='s,x,x,'
sbindir='${exec_prefix}/sbin'
sharedstatedir='${prefix}/com'
sysconfdir='${prefix}/etc'
target_alias=''

## ----------- ##
## confdefs.h. ##
## ----------- ##

#define HAVE_DLFCN_H 1
#define HAVE_INTTYPES_H 1
#define HAVE_MEMORY_H 1
#define HAVE_STDINT_H 1
#define HAVE_STDLIB_H 1
#define HAVE_STRINGS_H 1
#define HAVE_STRING_H 1
#define HAVE_SYS_STAT_H 1
#define HAVE_SYS_TYPES_H 1
#define HAVE_UNISTD_H 1
#define PACKAGE "gnumeric"
#define PACKAGE_BUGREPORT "http://bugzilla.gnome.org/enter_bug.cgi?product=gnumeric"
#define PACKAGE_NAME "gnumeric"
#define PACKAGE_STRING "gnumeric 1.6.0"
#define PACKAGE_TARNAME "gnumeric"
#define PACKAGE_VERSION "1.6.0"
#define STDC_HEADERS 1
#define STDC_HEADERS 1
#define VERSION "1.6.0"
#define WITH_GNOME 1
#define WITH_GTK 1
#endif
#ifdef __cplusplus
extern "C" void std::exit (int) throw (); using std::exit;

configure: exit 1