subversion/libsvn_ra_dav/commit.c: At top level:
subversion/libsvn_ra_dav/commit.c:930: error: parse error before '*' token
subversion/libsvn_ra_dav/commit.c: In function `pre_send_hook':
subversion/libsvn_ra_dav/commit.c:934: error: `userdata' undeclared (first use in this function)
subversion/libsvn_ra_dav/commit.c:936: error: dereferencing pointer to incomplete type
subversion/libsvn_ra_dav/commit.c:938: error: dereferencing pointer to incomplete type
subversion/libsvn_ra_dav/commit.c:939: error: `req' undeclared (first use in this function)
subversion/libsvn_ra_dav/commit.c:939: error: dereferencing pointer to incomplete type
subversion/libsvn_ra_dav/commit.c:940: error: dereferencing pointer to incomplete type
subversion/libsvn_ra_dav/commit.c:940: error: dereferencing pointer to incomplete type
subversion/libsvn_ra_dav/commit.c: In function `commit_add_dir':
subversion/libsvn_ra_dav/commit.c:952: error: `parent' undeclared (first use in this function)
subversion/libsvn_ra_dav/commit.c:953: error: `child' undeclared (first use in this function)
subversion/libsvn_ra_dav/commit.c:1009: error: `NE_DEPTH_INFINITE' undeclared (first use in this function)
subversion/libsvn_ra_dav/commit.c:1022: error: `NE_OK' undeclared (first use in this function)
subversion/libsvn_ra_dav/commit.c: In function `commit_open_dir':
subversion/libsvn_ra_dav/commit.c:1050: error: `parent' undeclared (first use in this function)
subversion/libsvn_ra_dav/commit.c:1051: error: `child' undeclared (first use in this function)
subversion/libsvn_ra_dav/commit.c: In function `commit_change_dir_prop':
subversion/libsvn_ra_dav/commit.c:1083: error: `dir' undeclared (first use in this function)
subversion/libsvn_ra_dav/commit.c: In function `commit_close_dir':
subversion/libsvn_ra_dav/commit.c:1101: error: `dir' undeclared (first use in this function)
subversion/libsvn_ra_dav/commit.c: In function `commit_add_file':
subversion/libsvn_ra_dav/commit.c:1117: error: `parent' undeclared (first use in this function)
subversion/libsvn_ra_dav/commit.c:1118: error: `file' undeclared (first use in this function)
subversion/libsvn_ra_dav/commit.c:1223: error: `NE_DEPTH_ZERO' undeclared (first use in this function)
subversion/libsvn_ra_dav/commit.c:1236: error: `NE_OK' undeclared (first use in this function)
subversion/libsvn_ra_dav/commit.c: In function `commit_open_file':
subversion/libsvn_ra_dav/commit.c:1265: error: `parent' undeclared (first use in this function)
subversion/libsvn_ra_dav/commit.c:1266: error: `file' undeclared (first use in this function)
subversion/libsvn_ra_dav/commit.c: In function `commit_apply_txdelta':
subversion/libsvn_ra_dav/commit.c:1319: error: `file' undeclared (first use in this function)
subversion/libsvn_ra_dav/commit.c: In function `commit_change_file_prop':
subversion/libsvn_ra_dav/commit.c:1361: error: `file' undeclared (first use in this function)
subversion/libsvn_ra_dav/commit.c: In function `commit_close_file':
subversion/libsvn_ra_dav/commit.c:1380: error: `file' undeclared (first use in this function)
subversion/libsvn_ra_dav/commit.c:1381: error: `cc' undeclared (first use in this function)
subversion/libsvn_ra_dav/commit.c:1385: error: `ne_session' undeclared (first use in this function)
subversion/libsvn_ra_dav/commit.c:1388: error: `ne_request' undeclared (first use in this function)
subversion/libsvn_ra_dav/commit.c:1388: error: `req' undeclared (first use in this function)
subversion/libsvn_ra_dav/commit.c: In function `commit_close_edit':
subversion/libsvn_ra_dav/commit.c:1459: error: `cc' undeclared (first use in this function)
subversion/libsvn_ra_dav/commit.c: At top level:
subversion/libsvn_ra_dav/commit.c:1491: error: parse error before '*' token
subversion/libsvn_ra_dav/commit.c: In function `apply_log_message':
subversion/libsvn_ra_dav/commit.c:1498: error: `ne_proppatch_operation' undeclared (first use in this function)
subversion/libsvn_ra_dav/commit.c:1498: error: parse error before "po"
subversion/libsvn_ra_dav/commit.c:1508: error: `cc' undeclared (first use in this function)
subversion/libsvn_ra_dav/commit.c:1552: error: `po' undeclared (first use in this function)
subversion/libsvn_ra_dav/commit.c:1553: error: `ne_propset' undeclared (first use in this function)
subversion/libsvn_ra_dav/commit.c:1557: error: `NE_OK' undeclared (first use in this function)
subversion/libsvn_ra_dav/commit.c: In function `svn_ra_dav__get_commit_editor':
subversion/libsvn_ra_dav/commit.c:1577: error: `ras' undeclared (first use in this function)
subversion/libsvn_ra_dav/commit.c:1579: error: `cc' undeclared (first use in this function)
make: *** [subversion/libsvn_ra_dav/commit.lo] Error 1