rendered paste bodyThis file contains any messages produced by compilers while
running configure, to aid debugging if configure makes a mistake.
It was created by qtparted configure 0.4.4, which was
generated by GNU Autoconf 2.58. Invocation command line was
$ ./configure
## --------- ##
## Platform. ##
## --------- ##
hostname = PC2
uname -m = x86_64
uname -r = 2.6.11.4-21.8-default
uname -s = Linux
uname -v = #1 Tue Jul 19 12:42:37 UTC 2005
/usr/bin/uname -p = unknown
/bin/uname -X = unknown
/bin/arch = x86_64
/usr/bin/arch -k = unknown
/usr/convex/getsysinfo = unknown
hostinfo = unknown
/bin/machine = unknown
/usr/bin/oslevel = unknown
/bin/universe = unknown
PATH: /usr/sbin
PATH: /bin
PATH: /usr/bin
PATH: /sbin
PATH: /usr/X11R6/bin
## ----------- ##
## Core tests. ##
## ----------- ##
configure:1566: checking build system type
configure:1584: result: x86_64-unknown-linux-gnu
configure:1592: checking host system type
configure:1606: result: x86_64-unknown-linux-gnu
configure:1614: checking target system type
configure:1628: result: x86_64-unknown-linux-gnu
configure:1670: checking for a BSD-compatible install
configure:1725: result: /usr/bin/install -c
configure:1740: checking for -p flag to install
configure:1753: result: yes
configure:1764: checking whether build environment is sane
configure:1807: result: yes
configure:1840: checking for gawk
configure:1856: found /bin/gawk
configure:1866: result: gawk
configure:1876: checking whether make sets $(MAKE)
configure:1896: result: yes
configure:2073: checking for style of include used by make
configure:2101: result: GNU
configure:2172: checking for gcc
configure:2188: found /usr/bin/gcc
configure:2198: result: gcc
configure:2442: checking for C compiler version
configure:2445: gcc --version </dev/null >&5
gcc (GCC) 3.3.5 20050117 (prerelease) (SUSE Linux)
Copyright (C) 2003 Free Software Foundation, Inc.
This is free software; see the source for copying conditions. There is NO
warranty; not even for MERCHANTABILITY or FITNESS FOR A PARTICULAR PURPOSE.
configure:2448: $? = 0
configure:2450: gcc -v </dev/null >&5
Reading specs from /usr/lib64/gcc-lib/x86_64-suse-linux/3.3.5/specs
Configured with: ../configure --enable-threads=posix --prefix=/usr --with-local-prefix=/usr/local --infodir=/usr/share/info --mandir=/usr/share/man --enable-languages=c,c++,f77,objc,java,ada --disable-checking --libdir=/usr/lib64 --enable-libgcj --with-slibdir=/lib64 --with-system-zlib --enable-shared --enable-__cxa_atexit x86_64-suse-linux
Thread model: posix
gcc version 3.3.5 20050117 (prerelease) (SUSE Linux)
configure:2453: $? = 0
configure:2455: gcc -V </dev/null >&5
gcc: `-V' option must have argument
configure:2458: $? = 1
configure:2481: checking for C compiler default output file name
configure:2484: gcc conftest.c >&5
configure:2487: $? = 0
configure:2533: result: a.out
configure:2538: checking whether the C compiler works
configure:2544: ./a.out
configure:2547: $? = 0
configure:2564: result: yes
configure:2571: checking whether we are cross compiling
configure:2573: result: no
configure:2576: checking for suffix of executables
configure:2578: gcc -o conftest conftest.c >&5
configure:2581: $? = 0
configure:2606: result:
configure:2612: checking for suffix of object files
configure:2633: gcc -c conftest.c >&5
configure:2636: $? = 0
configure:2658: result: o
configure:2662: checking whether we are using the GNU C compiler
configure:2686: gcc -c conftest.c >&5
configure:2692: $? = 0
configure:2696: test -z
|| test ! -s conftest.err
configure:2699: $? = 0
configure:2702: test -s conftest.o
configure:2705: $? = 0
configure:2718: result: yes
configure:2724: checking whether gcc accepts -g
configure:2745: gcc -c -g conftest.c >&5
configure:2751: $? = 0
configure:2755: test -z
|| test ! -s conftest.err
configure:2758: $? = 0
configure:2761: test -s conftest.o
configure:2764: $? = 0
configure:2775: result: yes
configure:2792: checking for gcc option to accept ANSI C
configure:2862: gcc -c -g -O2 conftest.c >&5
configure:2868: $? = 0
configure:2872: test -z
|| test ! -s conftest.err
configure:2875: $? = 0
configure:2878: test -s conftest.o
configure:2881: $? = 0
configure:2899: result: none needed
configure:2917: gcc -c -g -O2 conftest.c >&5
conftest.c:2: error: syntax error before "me"
configure:2923: $? = 1
configure: failed program was:
| #ifndef __cplusplus
| choke me
| #endif
configure:3058: checking dependency style of gcc
configure:3141: result: gcc3
configure:3159: checking whether byte ordering is bigendian
configure:3186: gcc -c -g -O2 conftest.c >&5
configure:3192: $? = 0
configure:3196: test -z
|| test ! -s conftest.err
configure:3199: $? = 0
configure:3202: test -s conftest.o
configure:3205: $? = 0
configure:3229: gcc -c -g -O2 conftest.c >&5
conftest.c: In function `main':
conftest.c:19: error: `not' undeclared (first use in this function)
conftest.c:19: error: (Each undeclared identifier is reported only once
conftest.c:19: error: for each function it appears in.)
conftest.c:19: error: syntax error before "big"
configure:3235: $? = 1
configure: failed program was:
| /* confdefs.h. */
|
| #define PACKAGE_NAME "qtparted"
| #define PACKAGE_TARNAME "qtparted"
| #define PACKAGE_VERSION "0.4.4"
| #define PACKAGE_STRING "qtparted 0.4.4"
| #define PACKAGE_BUGREPORT "zanac4ever@virgilio.it"
| #define HOMEPAGE "http://qtparted.sourceforge.net/"
| #define PACKAGE "qtparted"
| #define VERSION "0.4.4"
| /* end confdefs.h. */
| #include <sys/types.h>
| #include <sys/param.h>
|
| int
| main ()
| {
| #if BYTE_ORDER != BIG_ENDIAN
| not big endian
| #endif
|
| ;
| return 0;
| }
configure:3370: result: no
configure:3391: checking for strerror in -lcposix
configure:3421: gcc -o conftest -g -O2 conftest.c -lcposix >&5
/usr/lib64/gcc-lib/x86_64-suse-linux/3.3.5/../../../../x86_64-suse-linux/bin/ld: cannot find -lcposix
collect2: ld returned 1 exit status
configure:3427: $? = 1
configure: failed program was:
| /* confdefs.h. */
|
| #define PACKAGE_NAME "qtparted"
| #define PACKAGE_TARNAME "qtparted"
| #define PACKAGE_VERSION "0.4.4"
| #define PACKAGE_STRING "qtparted 0.4.4"
| #define PACKAGE_BUGREPORT "zanac4ever@virgilio.it"
| #define HOMEPAGE "http://qtparted.sourceforge.net/"
| #define PACKAGE "qtparted"
| #define VERSION "0.4.4"
| /* end confdefs.h. */
|
| /* Override any gcc2 internal prototype to avoid an error. */
| #ifdef __cplusplus
| extern "C"
| #endif
| /* We use char because int might match the return type of a gcc2
| builtin and then its argument prototype would still apply. */
| char strerror ();
| int
| main ()
| {
| strerror ();
| ;
| return 0;
| }
configure:3453: result: no
configure:3507: checking for gcc
configure:3533: result: gcc
configure:3777: checking for C compiler version
configure:3780: gcc --version </dev/null >&5
gcc (GCC) 3.3.5 20050117 (prerelease) (SUSE Linux)
Copyright (C) 2003 Free Software Foundation, Inc.
This is free software; see the source for copying conditions. There is NO
warranty; not even for MERCHANTABILITY or FITNESS FOR A PARTICULAR PURPOSE.
configure:3783: $? = 0
configure:3785: gcc -v </dev/null >&5
Reading specs from /usr/lib64/gcc-lib/x86_64-suse-linux/3.3.5/specs
Configured with: ../configure --enable-threads=posix --prefix=/usr --with-local-prefix=/usr/local --infodir=/usr/share/info --mandir=/usr/share/man --enable-languages=c,c++,f77,objc,java,ada --disable-checking --libdir=/usr/lib64 --enable-libgcj --with-slibdir=/lib64 --with-system-zlib --enable-shared --enable-__cxa_atexit x86_64-suse-linux
Thread model: posix
gcc version 3.3.5 20050117 (prerelease) (SUSE Linux)
configure:3788: $? = 0
configure:3790: gcc -V </dev/null >&5
gcc: `-V' option must have argument
configure:3793: $? = 1
configure:3796: checking whether we are using the GNU C compiler
configure:3852: result: yes
configure:3858: checking whether gcc accepts -g
configure:3909: result: yes
configure:3926: checking for gcc option to accept ANSI C
configure:4033: result: none needed
configure:4051: gcc -c -g -O2 conftest.c >&5
conftest.c:2: error: syntax error before "me"
configure:4057: $? = 1
configure: failed program was:
| #ifndef __cplusplus
| choke me
| #endif
configure:4192: checking dependency style of gcc
configure:4275: result: gcc3
configure:4344: checking for g++
configure:4360: found /usr/bin/g++
configure:4370: result: g++
configure:4386: checking for C++ compiler version
configure:4389: g++ --version </dev/null >&5
g++ (GCC) 3.3.5 20050117 (prerelease) (SUSE Linux)
Copyright (C) 2003 Free Software Foundation, Inc.
This is free software; see the source for copying conditions. There is NO
warranty; not even for MERCHANTABILITY or FITNESS FOR A PARTICULAR PURPOSE.
configure:4392: $? = 0
configure:4394: g++ -v </dev/null >&5
Reading specs from /usr/lib64/gcc-lib/x86_64-suse-linux/3.3.5/specs
Configured with: ../configure --enable-threads=posix --prefix=/usr --with-local-prefix=/usr/local --infodir=/usr/share/info --mandir=/usr/share/man --enable-languages=c,c++,f77,objc,java,ada --disable-checking --libdir=/usr/lib64 --enable-libgcj --with-slibdir=/lib64 --with-system-zlib --enable-shared --enable-__cxa_atexit x86_64-suse-linux
Thread model: posix
gcc version 3.3.5 20050117 (prerelease) (SUSE Linux)
configure:4397: $? = 0
configure:4399: g++ -V </dev/null >&5
g++: `-V' option must have argument
configure:4402: $? = 1
configure:4405: checking whether we are using the GNU C++ compiler
configure:4429: g++ -c conftest.cc >&5
configure:4435: $? = 0
configure:4439: test -z
|| test ! -s conftest.err
configure:4442: $? = 0
configure:4445: test -s conftest.o
configure:4448: $? = 0
configure:4461: result: yes
configure:4467: checking whether g++ accepts -g
configure:4488: g++ -c -g conftest.cc >&5
configure:4494: $? = 0
configure:4498: test -z
|| test ! -s conftest.err
configure:4501: $? = 0
configure:4504: test -s conftest.o
configure:4507: $? = 0
configure:4518: result: yes
configure:4560: g++ -c -g -O2 conftest.cc >&5
configure:4566: $? = 0
configure:4570: test -z
|| test ! -s conftest.err
configure:4573: $? = 0
configure:4576: test -s conftest.o
configure:4579: $? = 0
configure:4605: g++ -c -g -O2 conftest.cc >&5
conftest.cc: In function `int main()':
conftest.cc:16: error: `exit' undeclared (first use this function)
conftest.cc:16: error: (Each undeclared identifier is reported only once for
each function it appears in.)
configure:4611: $? = 1
configure: failed program was:
| /* confdefs.h. */
|
| #define PACKAGE_NAME "qtparted"
| #define PACKAGE_TARNAME "qtparted"
| #define PACKAGE_VERSION "0.4.4"
| #define PACKAGE_STRING "qtparted 0.4.4"
| #define PACKAGE_BUGREPORT "zanac4ever@virgilio.it"
| #define HOMEPAGE "http://qtparted.sourceforge.net/"
| #define PACKAGE "qtparted"
| #define VERSION "0.4.4"
| /* end confdefs.h. */
|
| int
| main ()
| {
| exit (42);
| ;
| return 0;
| }
configure:4560: g++ -c -g -O2 conftest.cc >&5
configure:4566: $? = 0
configure:4570: test -z
|| test ! -s conftest.err
configure:4573: $? = 0
configure:4576: test -s conftest.o
configure:4579: $? = 0
configure:4605: g++ -c -g -O2 conftest.cc >&5
configure:4611: $? = 0
configure:4615: test -z
|| test ! -s conftest.err
configure:4618: $? = 0
configure:4621: test -s conftest.o
configure:4624: $? = 0
configure:4649: checking dependency style of g++
configure:4732: result: gcc3
configure:4754: checking how to run the C preprocessor
configure:4789: gcc -E conftest.c
configure:4795: $? = 0
configure:4827: gcc -E conftest.c
conftest.c:15:28: ac_nonexistent.h: No such file or directory
configure:4833: $? = 1
configure: failed program was:
| /* confdefs.h. */
|
| #define PACKAGE_NAME "qtparted"
| #define PACKAGE_TARNAME "qtparted"
| #define PACKAGE_VERSION "0.4.4"
| #define PACKAGE_STRING "qtparted 0.4.4"
| #define PACKAGE_BUGREPORT "zanac4ever@virgilio.it"
| #define HOMEPAGE "http://qtparted.sourceforge.net/"
| #define PACKAGE "qtparted"
| #define VERSION "0.4.4"
| #ifdef __cplusplus
| extern "C" void std::exit (int) throw (); using std::exit;
| #endif
| /* end confdefs.h. */
| #include <ac_nonexistent.h>
configure:4872: result: gcc -E
configure:4896: gcc -E conftest.c
configure:4902: $? = 0
configure:4934: gcc -E conftest.c
conftest.c:15:28: ac_nonexistent.h: No such file or directory
configure:4940: $? = 1
configure: failed program was:
| /* confdefs.h. */
|
| #define PACKAGE_NAME "qtparted"
| #define PACKAGE_TARNAME "qtparted"
| #define PACKAGE_VERSION "0.4.4"
| #define PACKAGE_STRING "qtparted 0.4.4"
| #define PACKAGE_BUGREPORT "zanac4ever@virgilio.it"
| #define HOMEPAGE "http://qtparted.sourceforge.net/"
| #define PACKAGE "qtparted"
| #define VERSION "0.4.4"
| #ifdef __cplusplus
| extern "C" void std::exit (int) throw (); using std::exit;
| #endif
| /* end confdefs.h. */
| #include <ac_nonexistent.h>
configure:4984: checking for egrep
configure:4994: result: grep -E
configure:5000: checking whether gcc needs -traditional
configure:5042: result: no
configure:5050: checking for an ANSI C-conforming const
configure:5117: gcc -c -g -O2 conftest.c >&5
configure:5123: $? = 0
configure:5127: test -z
|| test ! -s conftest.err
configure:5130: $? = 0
configure:5133: test -s conftest.o
configure:5136: $? = 0
configure:5147: result: yes
configure:5157: checking for inline
configure:5178: gcc -c -g -O2 conftest.c >&5
configure:5184: $? = 0
configure:5188: test -z
|| test ! -s conftest.err
configure:5191: $? = 0
configure:5194: test -s conftest.o
configure:5197: $? = 0
configure:5209: result: inline
configure:5228: checking for ANSI C header files
configure:5253: gcc -c -g -O2 conftest.c >&5
configure:5259: $? = 0
configure:5263: test -z
|| test ! -s conftest.err
configure:5266: $? = 0
configure:5269: test -s conftest.o
configure:5272: $? = 0
configure:5361: gcc -o conftest -g -O2 conftest.c >&5
configure:5364: $? = 0
configure:5366: ./conftest
configure:5369: $? = 0
configure:5384: result: yes
configure:5408: checking for sys/types.h
configure:5424: gcc -c -g -O2 conftest.c >&5
configure:5430: $? = 0
configure:5434: test -z
|| test ! -s conftest.err
configure:5437: $? = 0
configure:5440: test -s conftest.o
configure:5443: $? = 0
configure:5454: result: yes
configure:5408: checking for sys/stat.h
configure:5424: gcc -c -g -O2 conftest.c >&5
configure:5430: $? = 0
configure:5434: test -z
|| test ! -s conftest.err
configure:5437: $? = 0
configure:5440: test -s conftest.o
configure:5443: $? = 0
configure:5454: result: yes
configure:5408: checking for stdlib.h
configure:5424: gcc -c -g -O2 conftest.c >&5
configure:5430: $? = 0
configure:5434: test -z
|| test ! -s conftest.err
configure:5437: $? = 0
configure:5440: test -s conftest.o
configure:5443: $? = 0
configure:5454: result: yes
configure:5408: checking for string.h
configure:5424: gcc -c -g -O2 conftest.c >&5
configure:5430: $? = 0
configure:5434: test -z
|| test ! -s conftest.err
configure:5437: $? = 0
configure:5440: test -s conftest.o
configure:5443: $? = 0
configure:5454: result: yes
configure:5408: checking for memory.h
configure:5424: gcc -c -g -O2 conftest.c >&5
configure:5430: $? = 0
configure:5434: test -z
|| test ! -s conftest.err
configure:5437: $? = 0
configure:5440: test -s conftest.o
configure:5443: $? = 0
configure:5454: result: yes
configure:5408: checking for strings.h
configure:5424: gcc -c -g -O2 conftest.c >&5
configure:5430: $? = 0
configure:5434: test -z
|| test ! -s conftest.err
configure:5437: $? = 0
configure:5440: test -s conftest.o
configure:5443: $? = 0
configure:5454: result: yes
configure:5408: checking for inttypes.h
configure:5424: gcc -c -g -O2 conftest.c >&5
configure:5430: $? = 0
configure:5434: test -z
|| test ! -s conftest.err
configure:5437: $? = 0
configure:5440: test -s conftest.o
configure:5443: $? = 0
configure:5454: result: yes
configure:5408: checking for stdint.h
configure:5424: gcc -c -g -O2 conftest.c >&5
configure:5430: $? = 0
configure:5434: test -z
|| test ! -s conftest.err
configure:5437: $? = 0
configure:5440: test -s conftest.o
configure:5443: $? = 0
configure:5454: result: yes
configure:5408: checking for unistd.h
configure:5424: gcc -c -g -O2 conftest.c >&5
configure:5430: $? = 0
configure:5434: test -z
|| test ! -s conftest.err
configure:5437: $? = 0
configure:5440: test -s conftest.o
configure:5443: $? = 0
configure:5454: result: yes
configure:5466: checking for size_t
configure:5490: gcc -c -g -O2 conftest.c >&5
configure:5496: $? = 0
configure:5500: test -z
|| test ! -s conftest.err
configure:5503: $? = 0
configure:5506: test -s conftest.o
configure:5509: $? = 0
configure:5520: result: yes
configure:5532: checking whether struct tm is in sys/time.h or time.h
configure:5555: gcc -c -g -O2 conftest.c >&5
configure:5561: $? = 0
configure:5565: test -z
|| test ! -s conftest.err
configure:5568: $? = 0
configure:5571: test -s conftest.o
configure:5574: $? = 0
configure:5585: result: time.h
configure:5727: checking for gcc
configure:5753: result: gcc
configure:5997: checking for C compiler version
configure:6000: gcc --version </dev/null >&5
gcc (GCC) 3.3.5 20050117 (prerelease) (SUSE Linux)
Copyright (C) 2003 Free Software Foundation, Inc.
This is free software; see the source for copying conditions. There is NO
warranty; not even for MERCHANTABILITY or FITNESS FOR A PARTICULAR PURPOSE.
configure:6003: $? = 0
configure:6005: gcc -v </dev/null >&5
Reading specs from /usr/lib64/gcc-lib/x86_64-suse-linux/3.3.5/specs
Configured with: ../configure --enable-threads=posix --prefix=/usr --with-local-prefix=/usr/local --infodir=/usr/share/info --mandir=/usr/share/man --enable-languages=c,c++,f77,objc,java,ada --disable-checking --libdir=/usr/lib64 --enable-libgcj --with-slibdir=/lib64 --with-system-zlib --enable-shared --enable-__cxa_atexit x86_64-suse-linux
Thread model: posix
gcc version 3.3.5 20050117 (prerelease) (SUSE Linux)
configure:6008: $? = 0
configure:6010: gcc -V </dev/null >&5
gcc: `-V' option must have argument
configure:6013: $? = 1
configure:6016: checking whether we are using the GNU C compiler
configure:6072: result: yes
configure:6078: checking whether gcc accepts -g
configure:6129: result: yes
configure:6146: checking for gcc option to accept ANSI C
configure:6253: result: none needed
configure:6271: gcc -c -g -O2 conftest.c >&5
conftest.c:2: error: syntax error before "me"
configure:6277: $? = 1
configure: failed program was:
| #ifndef __cplusplus
| choke me
| #endif
configure:6412: checking dependency style of gcc
configure:6495: result: gcc3
configure:6518: checking how to run the C preprocessor
configure:6636: result: gcc -E
configure:6660: gcc -E conftest.c
configure:6666: $? = 0
configure:6698: gcc -E conftest.c
conftest.c:25:28: ac_nonexistent.h: No such file or directory
configure:6704: $? = 1
configure: failed program was:
| /* confdefs.h. */
|
| #define PACKAGE_NAME "qtparted"
| #define PACKAGE_TARNAME "qtparted"
| #define PACKAGE_VERSION "0.4.4"
| #define PACKAGE_STRING "qtparted 0.4.4"
| #define PACKAGE_BUGREPORT "zanac4ever@virgilio.it"
| #define HOMEPAGE "http://qtparted.sourceforge.net/"
| #define PACKAGE "qtparted"
| #define VERSION "0.4.4"
| #ifdef __cplusplus
| extern "C" void std::exit (int) throw (); using std::exit;
| #endif
| #define STDC_HEADERS 1
| #define HAVE_SYS_TYPES_H 1
| #define HAVE_SYS_STAT_H 1
| #define HAVE_STDLIB_H 1
| #define HAVE_STRING_H 1
| #define HAVE_MEMORY_H 1
| #define HAVE_STRINGS_H 1
| #define HAVE_INTTYPES_H 1
| #define HAVE_STDINT_H 1
| #define HAVE_UNISTD_H 1
| /* end confdefs.h. */
| #include <ac_nonexistent.h>
configure:6870: checking for C++ compiler version
configure:6873: g++ --version </dev/null >&5
g++ (GCC) 3.3.5 20050117 (prerelease) (SUSE Linux)
Copyright (C) 2003 Free Software Foundation, Inc.
This is free software; see the source for copying conditions. There is NO
warranty; not even for MERCHANTABILITY or FITNESS FOR A PARTICULAR PURPOSE.
configure:6876: $? = 0
configure:6878: g++ -v </dev/null >&5
Reading specs from /usr/lib64/gcc-lib/x86_64-suse-linux/3.3.5/specs
Configured with: ../configure --enable-threads=posix --prefix=/usr --with-local-prefix=/usr/local --infodir=/usr/share/info --mandir=/usr/share/man --enable-languages=c,c++,f77,objc,java,ada --disable-checking --libdir=/usr/lib64 --enable-libgcj --with-slibdir=/lib64 --with-system-zlib --enable-shared --enable-__cxa_atexit x86_64-suse-linux
Thread model: posix
gcc version 3.3.5 20050117 (prerelease) (SUSE Linux)
configure:6881: $? = 0
configure:6883: g++ -V </dev/null >&5
g++: `-V' option must have argument
configure:6886: $? = 1
configure:6889: checking whether we are using the GNU C++ compiler
configure:6945: result: yes
configure:6951: checking whether g++ accepts -g
configure:7002: result: yes
configure:7044: g++ -c -g -O2 conftest.cc >&5
configure:7050: $? = 0
configure:7054: test -z
|| test ! -s conftest.err
configure:7057: $? = 0
configure:7060: test -s conftest.o
configure:7063: $? = 0
configure:7089: g++ -c -g -O2 conftest.cc >&5
configure:7095: $? = 0
configure:7099: test -z
|| test ! -s conftest.err
configure:7102: $? = 0
configure:7105: test -s conftest.o
configure:7108: $? = 0
configure:7133: checking dependency style of g++
configure:7216: result: gcc3
configure:7636: checking whether g++ supports -Wundef
configure:7672: rm -rf SunWS_cache; g++ -o conftest -Wall -pedantic -W -Wpointer-arith -Wwrite-strings -ansi -D_XOPEN_SOURCE=500 -D_BSD_SOURCE -Wcast-align -Wconversion -O2 -g -O2 -Wundef conftest.cc 1>&5
configure:7678: $? = 0
configure:7682: test -z
|| test ! -s conftest.err
configure:7685: $? = 0
configure:7688: test -s conftest
configure:7691: $? = 0
configure:7712: result: yes
configure:7724: checking whether g++ supports -Wno-long-long
configure:7760: rm -rf SunWS_cache; g++ -o conftest -Wundef -Wall -pedantic -W -Wpointer-arith -Wwrite-strings -ansi -D_XOPEN_SOURCE=500 -D_BSD_SOURCE -Wcast-align -Wconversion -O2 -g -O2 -Wno-long-long conftest.cc 1>&5
configure:7766: $? = 0
configure:7770: test -z
|| test ! -s conftest.err
configure:7773: $? = 0
configure:7776: test -s conftest
configure:7779: $? = 0
configure:7800: result: yes
configure:7812: checking whether g++ supports -Wnon-virtual-dtor
configure:7848: rm -rf SunWS_cache; g++ -o conftest -Wno-long-long -Wundef -Wall -pedantic -W -Wpointer-arith -Wwrite-strings -ansi -D_XOPEN_SOURCE=500 -D_BSD_SOURCE -Wcast-align -Wconversion -O2 -g -O2 -Wnon-virtual-dtor conftest.cc 1>&5
configure:7854: $? = 0
configure:7858: test -z
|| test ! -s conftest.err
configure:7861: $? = 0
configure:7864: test -s conftest
configure:7867: $? = 0
configure:7888: result: yes
configure:7908: checking whether g++ supports -fno-exceptions
configure:7944: rm -rf SunWS_cache; g++ -o conftest -Wnon-virtual-dtor -Wno-long-long -Wundef -Wall -pedantic -W -Wpointer-arith -Wwrite-strings -ansi -D_XOPEN_SOURCE=500 -D_BSD_SOURCE -Wcast-align -Wconversion -O2 -g -O2 -fno-exceptions conftest.cc 1>&5
configure:7950: $? = 0
configure:7954: test -z
|| test ! -s conftest.err
configure:7957: $? = 0
configure:7960: test -s conftest
configure:7963: $? = 0
configure:7984: result: yes
configure:7996: checking whether g++ supports -fno-check-new
configure:8032: rm -rf SunWS_cache; g++ -o conftest -Wnon-virtual-dtor -Wno-long-long -Wundef -Wall -pedantic -W -Wpointer-arith -Wwrite-strings -ansi -D_XOPEN_SOURCE=500 -D_BSD_SOURCE -Wcast-align -Wconversion -O2 -g -O2 -fno-exceptions -fno-check-new conftest.cc 1>&5
configure:8038: $? = 0
configure:8042: test -z
|| test ! -s conftest.err
configure:8045: $? = 0
configure:8048: test -s conftest
configure:8051: $? = 0
configure:8072: result: yes
configure:8084: checking whether g++ supports -fexceptions
configure:8120: rm -rf SunWS_cache; g++ -o conftest -Wnon-virtual-dtor -Wno-long-long -Wundef -Wall -pedantic -W -Wpointer-arith -Wwrite-strings -ansi -D_XOPEN_SOURCE=500 -D_BSD_SOURCE -Wcast-align -Wconversion -O2 -g -O2 -fno-exceptions -fno-check-new -fexceptions conftest.cc 1>&5
configure:8126: $? = 0
configure:8130: test -z
|| test ! -s conftest.err
configure:8133: $? = 0
configure:8136: test -s conftest
configure:8139: $? = 0
configure:8160: result: yes
configure:8821: checking how to run the C++ preprocessor
configure:8852: g++ -E conftest.cc
configure:8858: $? = 0
configure:8890: g++ -E conftest.cc
conftest.cc:25:28: ac_nonexistent.h: No such file or directory
configure:8896: $? = 1
configure: failed program was:
| /* confdefs.h. */
|
| #define PACKAGE_NAME "qtparted"
| #define PACKAGE_TARNAME "qtparted"
| #define PACKAGE_VERSION "0.4.4"
| #define PACKAGE_STRING "qtparted 0.4.4"
| #define PACKAGE_BUGREPORT "zanac4ever@virgilio.it"
| #define HOMEPAGE "http://qtparted.sourceforge.net/"
| #define PACKAGE "qtparted"
| #define VERSION "0.4.4"
| #ifdef __cplusplus
| extern "C" void std::exit (int) throw (); using std::exit;
| #endif
| #define STDC_HEADERS 1
| #define HAVE_SYS_TYPES_H 1
| #define HAVE_SYS_STAT_H 1
| #define HAVE_STDLIB_H 1
| #define HAVE_STRING_H 1
| #define HAVE_MEMORY_H 1
| #define HAVE_STRINGS_H 1
| #define HAVE_INTTYPES_H 1
| #define HAVE_STDINT_H 1
| #define HAVE_UNISTD_H 1
| /* end confdefs.h. */
| #include <ac_nonexistent.h>
configure:8935: result: g++ -E
configure:8959: g++ -E conftest.cc
configure:8965: $? = 0
configure:8997: g++ -E conftest.cc
conftest.cc:25:28: ac_nonexistent.h: No such file or directory
configure:9003: $? = 1
configure: failed program was:
| /* confdefs.h. */
[...]
configure:23362: test -z
|| test ! -s conftest.err
configure:23365: $? = 0
configure:23368: test -s conftest
configure:23371: $? = 0
configure:23384: result: yes
configure:23390: checking for main in -lcompat
configure:23414: gcc -o conftest -ansi -W -Wall -pedantic -Wshadow -Wpointer-arith -Wmissing-prototypes -Wwrite-strings -D_XOPEN_SOURCE=500 -D_BSD_SOURCE -O2 -g -O2 conftest.c -lcompat -lreiserfs -lparted -ldl -luuid >&5
/usr/lib64/gcc-lib/x86_64-suse-linux/3.3.5/../../../../x86_64-suse-linux/bin/ld: cannot find -lcompat
collect2: ld returned 1 exit status
configure:23420: $? = 1
configure: failed program was:
| /* confdefs.h. */
|
| #define PACKAGE_NAME "qtparted"
| #define PACKAGE_TARNAME "qtparted"
| #define PACKAGE_VERSION "0.4.4"
| #define PACKAGE_STRING "qtparted 0.4.4"
| #define PACKAGE_BUGREPORT "zanac4ever@virgilio.it"
| #define HOMEPAGE "http://qtparted.sourceforge.net/"
| #define PACKAGE "qtparted"
| #define VERSION "0.4.4"
| #ifdef __cplusplus
| extern "C" void std::exit (int) throw (); using std::exit;
| #endif
| #define STDC_HEADERS 1
| #define HAVE_SYS_TYPES_H 1
| #define HAVE_SYS_STAT_H 1
| #define HAVE_STDLIB_H 1
| #define HAVE_STRING_H 1
| #define HAVE_MEMORY_H 1
| #define HAVE_STRINGS_H 1
| #define HAVE_INTTYPES_H 1
| #define HAVE_STDINT_H 1
| #define HAVE_UNISTD_H 1
| #define HAVE_TEMPLATE_REPOSITORY 1
| #define KDELIBSUFF ""
| #define HAVE_DLFCN_H 1
| #define SIZEOF_SHORT 2
| #define SIZEOF_LONG 8
| #define SIZEOF_INT 4
| #define SIZEOF_VOID_P 8
| #define SIZEOF_LONG_LONG 8
| #define HAVE_LIBUUID 1
| #define HAVE_LIBDL 1
| #define HAVE_LIBPARTED 1
| #define HAVE_LIBREISERFS 1
| /* end confdefs.h. */
|
|
| int
| main ()
| {
| main ();
| ;
| return 0;
| }
configure:23446: result: no
configure:23453: checking for crypt in -lcrypt
configure:23483: gcc -o conftest -ansi -W -Wall -pedantic -Wshadow -Wpointer-arith -Wmissing-prototypes -Wwrite-strings -D_XOPEN_SOURCE=500 -D_BSD_SOURCE -O2 -g -O2 conftest.c -lcrypt -lreiserfs -lparted -ldl -luuid >&5
configure:23489: $? = 0
configure:23493: test -z
|| test ! -s conftest.err
configure:23496: $? = 0
configure:23499: test -s conftest
configure:23502: $? = 0
configure:23515: result: yes
configure:23609: checking for socklen_t
configure:23648: g++ -c -Wnon-virtual-dtor -Wno-long-long -Wundef -Wall -pedantic -W -Wpointer-arith -Wwrite-strings -ansi -D_XOPEN_SOURCE=500 -D_BSD_SOURCE -Wcast-align -Wconversion -O2 -g -O2 -fno-exceptions -fno-check-new conftest.cc >&5
configure:23654: $? = 0
configure:23658: test -z
|| test ! -s conftest.err
configure:23661: $? = 0
configure:23664: test -s conftest.o
configure:23667: $? = 0
configure:23739: result: socklen_t
configure:23761: checking for dnet_ntoa in -ldnet
configure:23791: gcc -o conftest -ansi -W -Wall -pedantic -Wshadow -Wpointer-arith -Wmissing-prototypes -Wwrite-strings -D_XOPEN_SOURCE=500 -D_BSD_SOURCE -O2 -g -O2 conftest.c -ldnet -lreiserfs -lparted -ldl -luuid >&5
/usr/lib64/gcc-lib/x86_64-suse-linux/3.3.5/../../../../x86_64-suse-linux/bin/ld: cannot find -ldnet
collect2: ld returned 1 exit status
configure:23797: $? = 1
configure: failed program was:
| /* confdefs.h. */
|
| #define PACKAGE_NAME "qtparted"
| #define PACKAGE_TARNAME "qtparted"
| #define PACKAGE_VERSION "0.4.4"
| #define PACKAGE_STRING "qtparted 0.4.4"
| #define PACKAGE_BUGREPORT "zanac4ever@virgilio.it"
| #define HOMEPAGE "http://qtparted.sourceforge.net/"
| #define PACKAGE "qtparted"
| #define VERSION "0.4.4"
| #ifdef __cplusplus
| extern "C" void std::exit (int) throw (); using std::exit;
| #endif
| #define STDC_HEADERS 1
| #define HAVE_SYS_TYPES_H 1
| #define HAVE_SYS_STAT_H 1
| #define HAVE_STDLIB_H 1
| #define HAVE_STRING_H 1
| #define HAVE_MEMORY_H 1
| #define HAVE_STRINGS_H 1
| #define HAVE_INTTYPES_H 1
| #define HAVE_STDINT_H 1
| #define HAVE_UNISTD_H 1
| #define HAVE_TEMPLATE_REPOSITORY 1
| #define KDELIBSUFF ""
| #define HAVE_DLFCN_H 1
| #define SIZEOF_SHORT 2
| #define SIZEOF_LONG 8
| #define SIZEOF_INT 4
| #define SIZEOF_VOID_P 8
| #define SIZEOF_LONG_LONG 8
| #define HAVE_LIBUUID 1
| #define HAVE_LIBDL 1
| #define HAVE_LIBPARTED 1
| #define HAVE_LIBREISERFS 1
| #define HAVE_CRYPT 1
| #define ksize_t socklen_t
| /* end confdefs.h. */
|
| /* Override any gcc2 internal prototype to avoid an error. */
| #ifdef __cplusplus
| extern "C"
| #endif
| /* We use char because int might match the return type of a gcc2
| builtin and then its argument prototype would still apply. */
| char dnet_ntoa ();
| int
| main ()
| {
| dnet_ntoa ();
| ;
| return 0;
| }
configure:23823: result: no
configure:23830: checking for dnet_ntoa in -ldnet_stub
configure:23860: gcc -o conftest -ansi -W -Wall -pedantic -Wshadow -Wpointer-arith -Wmissing-prototypes -Wwrite-strings -D_XOPEN_SOURCE=500 -D_BSD_SOURCE -O2 -g -O2 conftest.c -ldnet_stub -lreiserfs -lparted -ldl -luuid >&5
/usr/lib64/gcc-lib/x86_64-suse-linux/3.3.5/../../../../x86_64-suse-linux/bin/ld: cannot find -ldnet_stub
collect2: ld returned 1 exit status
configure:23866: $? = 1
configure: failed program was:
| /* confdefs.h. */
|
| #define PACKAGE_NAME "qtparted"
| #define PACKAGE_TARNAME "qtparted"
| #define PACKAGE_VERSION "0.4.4"
| #define PACKAGE_STRING "qtparted 0.4.4"
| #define PACKAGE_BUGREPORT "zanac4ever@virgilio.it"
| #define HOMEPAGE "http://qtparted.sourceforge.net/"
| #define PACKAGE "qtparted"
| #define VERSION "0.4.4"
| #ifdef __cplusplus
| extern "C" void std::exit (int) throw (); using std::exit;
| #endif
| #define STDC_HEADERS 1
| #define HAVE_SYS_TYPES_H 1
| #define HAVE_SYS_STAT_H 1
| #define HAVE_STDLIB_H 1
| #define HAVE_STRING_H 1
| #define HAVE_MEMORY_H 1
| #define HAVE_STRINGS_H 1
| #define HAVE_INTTYPES_H 1
| #define HAVE_STDINT_H 1
| #define HAVE_UNISTD_H 1
| #define HAVE_TEMPLATE_REPOSITORY 1
| #define KDELIBSUFF ""
| #define HAVE_DLFCN_H 1
| #define SIZEOF_SHORT 2
| #define SIZEOF_LONG 8
| #define SIZEOF_INT 4
| #define SIZEOF_VOID_P 8
| #define SIZEOF_LONG_LONG 8
| #define HAVE_LIBUUID 1
| #define HAVE_LIBDL 1
| #define HAVE_LIBPARTED 1
| #define HAVE_LIBREISERFS 1
| #define HAVE_CRYPT 1
| #define ksize_t socklen_t
| /* end confdefs.h. */
|
| /* Override any gcc2 internal prototype to avoid an error. */
| #ifdef __cplusplus
| extern "C"
| #endif
| /* We use char because int might match the return type of a gcc2
| builtin and then its argument prototype would still apply. */
| char dnet_ntoa ();
| int
| main ()
| {
| dnet_ntoa ();
| ;
| return 0;
| }
configure:23892: result: no
configure:23899: checking for inet_ntoa
configure:23956: gcc -o conftest -ansi -W -Wall -pedantic -Wshadow -Wpointer-arith -Wmissing-prototypes -Wwrite-strings -D_XOPEN_SOURCE=500 -D_BSD_SOURCE -O2 -g -O2 conftest.c -lreiserfs -lparted -ldl -luuid >&5
configure:23962: $? = 0
configure:23966: test -z
|| test ! -s conftest.err
configure:23969: $? = 0
configure:23972: test -s conftest
configure:23975: $? = 0
configure:23987: result: yes
configure:24060: checking for connect
configure:24117: gcc -o conftest -ansi -W -Wall -pedantic -Wshadow -Wpointer-arith -Wmissing-prototypes -Wwrite-strings -D_XOPEN_SOURCE=500 -D_BSD_SOURCE -O2 -g -O2 conftest.c -lreiserfs -lparted -ldl -luuid >&5
configure:24123: $? = 0
configure:24127: test -z
|| test ! -s conftest.err
configure:24130: $? = 0
configure:24133: test -s conftest
configure:24136: $? = 0
configure:24148: result: yes
configure:24222: checking for remove
configure:24279: gcc -o conftest -ansi -W -Wall -pedantic -Wshadow -Wpointer-arith -Wmissing-prototypes -Wwrite-strings -D_XOPEN_SOURCE=500 -D_BSD_SOURCE -O2 -g -O2 conftest.c -lreiserfs -lparted -ldl -luuid >&5
configure:24285: $? = 0
configure:24289: test -z
|| test ! -s conftest.err
configure:24292: $? = 0
configure:24295: test -s conftest
configure:24298: $? = 0
configure:24310: result: yes
configure:24385: checking for shmat
configure:24442: gcc -o conftest -ansi -W -Wall -pedantic -Wshadow -Wpointer-arith -Wmissing-prototypes -Wwrite-strings -D_XOPEN_SOURCE=500 -D_BSD_SOURCE -O2 -g -O2 conftest.c -lreiserfs -lparted -ldl -luuid >&5
configure:24448: $? = 0
configure:24452: test -z
|| test ! -s conftest.err
configure:24455: $? = 0
configure:24458: test -s conftest
configure:24461: $? = 0
configure:24473: result: yes
configure:24564: checking crt_externs.h usability
configure:24576: gcc -c -ansi -W -Wall -pedantic -Wshadow -Wpointer-arith -Wmissing-prototypes -Wwrite-strings -D_XOPEN_SOURCE=500 -D_BSD_SOURCE -O2 -g -O2 conftest.c >&5
conftest.c:73:25: crt_externs.h: No such file or directory
configure:24582: $? = 1
configure: failed program was:
| /* confdefs.h. */
|
| #define PACKAGE_NAME "qtparted"
| #define PACKAGE_TARNAME "qtparted"
| #define PACKAGE_VERSION "0.4.4"
| #define PACKAGE_STRING "qtparted 0.4.4"
| #define PACKAGE_BUGREPORT "zanac4ever@virgilio.it"
| #define HOMEPAGE "http://qtparted.sourceforge.net/"
| #define PACKAGE "qtparted"
| #define VERSION "0.4.4"
| #ifdef __cplusplus
| extern "C" void std::exit (int) throw (); using std::exit;
| #endif
| #define STDC_HEADERS 1
| #define HAVE_SYS_TYPES_H 1
| #define HAVE_SYS_STAT_H 1
| #define HAVE_STDLIB_H 1
| #define HAVE_STRING_H 1
| #define HAVE_MEMORY_H 1
| #define HAVE_STRINGS_H 1
| #define HAVE_INTTYPES_H 1
| #define HAVE_STDINT_H 1
| #define HAVE_UNISTD_H 1
| #define HAVE_TEMPLATE_REPOSITORY 1
| #define KDELIBSUFF ""
| #define HAVE_DLFCN_H 1
| #define SIZEOF_SHORT 2
| #define SIZEOF_LONG 8
| #define SIZEOF_INT 4
| #define SIZEOF_VOID_P 8
| #define SIZEOF_LONG_LONG 8
| #define HAVE_LIBUUID 1
| #define HAVE_LIBDL 1
| #define HAVE_LIBPARTED 1
| #define HAVE_LIBREISERFS 1
| #define HAVE_CRYPT 1
| #define ksize_t socklen_t
| /* end confdefs.h. */
| #include <stdio.h>
| #if HAVE_SYS_TYPES_H
| # include <sys/types.h>
| #endif
| #if HAVE_SYS_STAT_H
| # include <sys/stat.h>
| #endif
| #if STDC_HEADERS
| # include <stdlib.h>
| # include <stddef.h>
| #else
| # if HAVE_STDLIB_H
| # include <stdlib.h>
| # endif
| #endif
| #if HAVE_STRING_H
| # if !STDC_HEADERS && HAVE_MEMORY_H
| # include <memory.h>
| # endif
| # include <string.h>
| #endif
| #if HAVE_STRINGS_H
| # include <strings.h>
| #endif
| #if HAVE_INTTYPES_H
| # include <inttypes.h>
| #else
| # if HAVE_STDINT_H
| # include <stdint.h>
| # endif
| #endif
| #if HAVE_UNISTD_H
| # include <unistd.h>
| #endif
| #include <crt_externs.h>
configure:24605: result: no
configure:24609: checking crt_externs.h presence
configure:24619: gcc -E conftest.c
conftest.c:39:25: crt_externs.h: No such file or directory
configure:24625: $? = 1
configure: failed program was:
| /* confdefs.h. */
|
| #define PACKAGE_NAME "qtparted"
| #define PACKAGE_TARNAME "qtparted"
| #define PACKAGE_VERSION "0.4.4"
| #define PACKAGE_STRING "qtparted 0.4.4"
| #define PACKAGE_BUGREPORT "zanac4ever@virgilio.it"
| #define HOMEPAGE "http://qtparted.sourceforge.net/"
| #define PACKAGE "qtparted"
| #define VERSION "0.4.4"
| #ifdef __cplusplus
| extern "C" void std::exit (int) throw (); using std::exit;
| #endif
| #define STDC_HEADERS 1
| #define HAVE_SYS_TYPES_H 1
| #define HAVE_SYS_STAT_H 1
| #define HAVE_STDLIB_H 1
| #define HAVE_STRING_H 1
| #define HAVE_MEMORY_H 1
| #define HAVE_STRINGS_H 1
| #define HAVE_INTTYPES_H 1
| #define HAVE_STDINT_H 1
| #define HAVE_UNISTD_H 1
| #define HAVE_TEMPLATE_REPOSITORY 1
| #define KDELIBSUFF ""
| #define HAVE_DLFCN_H 1
| #define SIZEOF_SHORT 2
| #define SIZEOF_LONG 8
| #define SIZEOF_INT 4
| #define SIZEOF_VOID_P 8
| #define SIZEOF_LONG_LONG 8
| #define HAVE_LIBUUID 1
| #define HAVE_LIBDL 1
| #define HAVE_LIBPARTED 1
| #define HAVE_LIBREISERFS 1
| #define HAVE_CRYPT 1
| #define ksize_t socklen_t
| /* end confdefs.h. */
| #include <crt_externs.h>
configure:24645: result: no
configure:24680: checking for crt_externs.h
configure:24687: result: no
configure:24700: checking for _NSGetEnviron
configure:24757: gcc -o conftest -ansi -W -Wall -pedantic -Wshadow -Wpointer-arith -Wmissing-prototypes -Wwrite-strings -D_XOPEN_SOURCE=500 -D_BSD_SOURCE -O2 -g -O2 conftest.c -lreiserfs -lparted -ldl -luuid >&5
/tmp/ccolQgM1.o(.text+0x9): In function `main':
/Install/qtparted-0.4.4/conftest.c:79: undefined reference to `_NSGetEnviron'
/tmp/ccolQgM1.o(.data+0x0): undefined reference to `_NSGetEnviron'
collect2: ld returned 1 exit status
configure:24763: $? = 1
configure: failed program was:
| /* confdefs.h. */
|
| #define PACKAGE_NAME "qtparted"
| #define PACKAGE_TARNAME "qtparted"
| #define PACKAGE_VERSION "0.4.4"
| #define PACKAGE_STRING "qtparted 0.4.4"
| #define PACKAGE_BUGREPORT "zanac4ever@virgilio.it"
| #define HOMEPAGE "http://qtparted.sourceforge.net/"
| #define PACKAGE "qtparted"
| #define VERSION "0.4.4"
| #ifdef __cplusplus
| extern "C" void std::exit (int) throw (); using std::exit;
| #endif
| #define STDC_HEADERS 1
| #define HAVE_SYS_TYPES_H 1
| #define HAVE_SYS_STAT_H 1
| #define HAVE_STDLIB_H 1
| #define HAVE_STRING_H 1
| #define HAVE_MEMORY_H 1
| #define HAVE_STRINGS_H 1
| #define HAVE_INTTYPES_H 1
| #define HAVE_STDINT_H 1
| #define HAVE_UNISTD_H 1
| #define HAVE_TEMPLATE_REPOSITORY 1
| #define KDELIBSUFF ""
| #define HAVE_DLFCN_H 1
| #define SIZEOF_SHORT 2
| #define SIZEOF_LONG 8
| #define SIZEOF_INT 4
| #define SIZEOF_VOID_P 8
| #define SIZEOF_LONG_LONG 8
| #define HAVE_LIBUUID 1
| #define HAVE_LIBDL 1
| #define HAVE_LIBPARTED 1
| #define HAVE_LIBREISERFS 1
| #define HAVE_CRYPT 1
| #define ksize_t socklen_t
| /* end confdefs.h. */
| /* Define _NSGetEnviron to an innocuous variant, in case <limits.h> declares _NSGetEnviron.
| For example, HP-UX 11i <limits.h> declares gettimeofday. */
| #define _NSGetEnviron innocuous__NSGetEnviron
|
| /* System header to define __stub macros and hopefully few prototypes,
| which can conflict with char _NSGetEnviron (); below.
| Prefer <limits.h> to <assert.h> if __STDC__ is defined, since
| <limits.h> exists even on freestanding compilers. */
|
| #ifdef __STDC__
| # include <limits.h>
| #else
| # include <assert.h>
| #endif
|
| #undef _NSGetEnviron
|
| /* Override any gcc2 internal prototype to avoid an error. */
| #ifdef __cplusplus
| extern "C"
| {
| #endif
| /* We use char because int might match the return type of a gcc2
| builtin and then its argument prototype would still apply. */
| char _NSGetEnviron ();
| /* The GNU C library defines this for functions which it implements
| to always fail with ENOSYS. Some functions are actually named
| something starting with __ and the normal name is an alias. */
| #if defined (__stub__NSGetEnviron) || defined (__stub____NSGetEnviron)
| choke me
| #else
| char (*f) () = _NSGetEnviron;
| #endif
| #ifdef __cplusplus
| }
| #endif
|
| int
| main ()
| {
| return f != _NSGetEnviron;
| ;
| return 0;
| }
configure:24788: result: no
configure:24806: checking for sys/types.h
configure:24811: result: yes
configure:24806: checking for stdint.h
configure:24811: result: yes
configure:24953: checking for poll in -lpoll
configure:24983: gcc -o conftest -ansi -W -Wall -pedantic -Wshadow -Wpointer-arith -Wmissing-prototypes -Wwrite-strings -D_XOPEN_SOURCE=500 -D_BSD_SOURCE -O2 -g -O2 conftest.c -lpoll -lreiserfs -lparted -ldl -luuid >&5
/usr/lib64/gcc-lib/x86_64-suse-linux/3.3.5/../../../../x86_64-suse-linux/bin/ld: cannot find -lpoll
collect2: ld returned 1 exit status
configure:24989: $? = 1
configure: failed program was:
| /* confdefs.h. */
|
| #define PACKAGE_NAME "qtparted"
| #define PACKAGE_TARNAME "qtparted"
| #define PACKAGE_VERSION "0.4.4"
| #define PACKAGE_STRING "qtparted 0.4.4"
| #define PACKAGE_BUGREPORT "zanac4ever@virgilio.it"
| #define HOMEPAGE "http://qtparted.sourceforge.net/"
| #define PACKAGE "qtparted"
| #define VERSION "0.4.4"
| #ifdef __cplusplus
| extern "C" void std::exit (int) throw (); using std::exit;
| #endif
| #define STDC_HEADERS 1
| #define HAVE_SYS_TYPES_H 1
| #define HAVE_SYS_STAT_H 1
| #define HAVE_STDLIB_H 1
| #define HAVE_STRING_H 1
| #define HAVE_MEMORY_H 1
| #define HAVE_STRINGS_H 1
| #define HAVE_INTTYPES_H 1
| #define HAVE_STDINT_H 1
| #define HAVE_UNISTD_H 1
| #define HAVE_TEMPLATE_REPOSITORY 1
| #define KDELIBSUFF ""
| #define HAVE_DLFCN_H 1
| #define SIZEOF_SHORT 2
| #define SIZEOF_LONG 8
| #define SIZEOF_INT 4
| #define SIZEOF_VOID_P 8
| #define SIZEOF_LONG_LONG 8
| #define HAVE_LIBUUID 1
| #define HAVE_LIBDL 1
| #define HAVE_LIBPARTED 1
| #define HAVE_LIBREISERFS 1
| #define HAVE_CRYPT 1
| #define ksize_t socklen_t
| #define HAVE_SYS_TYPES_H 1
| #define HAVE_STDINT_H 1
| /* end confdefs.h. */
|
| /* Override any gcc2 internal prototype to avoid an error. */
| #ifdef __cplusplus
| extern "C"
| #endif
| /* We use char because int might match the return type of a gcc2
| builtin and then its argument prototype would still apply. */
| char poll ();
| int
| main ()
| {
| poll ();
| ;
| return 0;
| }
configure:25015: result: no
configure:25033: checking CoreAudio/CoreAudio.h usability
configure:25045: gcc -c -ansi -W -Wall -pedantic -Wshadow -Wpointer-arith -Wmissing-prototypes -Wwrite-strings -D_XOPEN_SOURCE=500 -D_BSD_SOURCE -O2 -g -O2 conftest.c >&5
conftest.c:75:33: CoreAudio/CoreAudio.h: No such file or directory
configure:25051: $? = 1
configure: failed program was:
| /* confdefs.h. */
|
| #define PACKAGE_NAME "qtparted"
| #define PACKAGE_TARNAME "qtparted"
| #define PACKAGE_VERSION "0.4.4"
| #define PACKAGE_STRING "qtparted 0.4.4"
| #define PACKAGE_BUGREPORT "zanac4ever@virgilio.it"
| #define HOMEPAGE "http://qtparted.sourceforge.net/"
| #define PACKAGE "qtparted"
| #define VERSION "0.4.4"
| #ifdef __cplusplus
| extern "C" void std::exit (int) throw (); using std::exit;
| #endif
| #define STDC_HEADERS 1
| #define HAVE_SYS_TYPES_H 1
| #define HAVE_SYS_STAT_H 1
| #define HAVE_STDLIB_H 1
| #define HAVE_STRING_H 1
| #define HAVE_MEMORY_H 1
| #define HAVE_STRINGS_H 1
| #define HAVE_INTTYPES_H 1
| #define HAVE_STDINT_H 1
| #define HAVE_UNISTD_H 1
| #define HAVE_TEMPLATE_REPOSITORY 1
| #define KDELIBSUFF ""
| #define HAVE_DLFCN_H 1
| #define SIZEOF_SHORT 2
| #define SIZEOF_LONG 8
| #define SIZEOF_INT 4
| #define SIZEOF_VOID_P 8
| #define SIZEOF_LONG_LONG 8
| #define HAVE_LIBUUID 1
| #define HAVE_LIBDL 1
| #define HAVE_LIBPARTED 1
| #define HAVE_LIBREISERFS 1
| #define HAVE_CRYPT 1
| #define ksize_t socklen_t
| #define HAVE_SYS_TYPES_H 1
| #define HAVE_STDINT_H 1
| /* end confdefs.h. */
| #include <stdio.h>
| #if HAVE_SYS_TYPES_H
| # include <sys/types.h>
| #endif
| #if HAVE_SYS_STAT_H
| # include <sys/stat.h>
| #endif
| #if STDC_HEADERS
| # include <stdlib.h>
| # include <stddef.h>
| #else
| # if HAVE_STDLIB_H
| # include <stdlib.h>
| # endif
| #endif
| #if HAVE_STRING_H
| # if !STDC_HEADERS && HAVE_MEMORY_H
| # include <memory.h>
| # endif
| # include <string.h>
| #endif
| #if HAVE_STRINGS_H
| # include <strings.h>
| #endif
| #if HAVE_INTTYPES_H
| # include <inttypes.h>
| #else
| # if HAVE_STDINT_H
| # include <stdint.h>
| # endif
| #endif
| #if HAVE_UNISTD_H
| # include <unistd.h>
| #endif
| #include <CoreAudio/CoreAudio.h>
configure:25074: result: no
configure:25078: checking CoreAudio/CoreAudio.h presence
configure:25088: gcc -E conftest.c
conftest.c:41:33: CoreAudio/CoreAudio.h: No such file or directory
configure:25094: $? = 1
configure: failed program was:
| /* confdefs.h. */
|
| #define PACKAGE_NAME "qtparted"
| #define PACKAGE_TARNAME "qtparted"
| #define PACKAGE_VERSION "0.4.4"
| #define PACKAGE_STRING "qtparted 0.4.4"
| #define PACKAGE_BUGREPORT "zanac4ever@virgilio.it"
| #define HOMEPAGE "http://qtparted.sourceforge.net/"
| #define PACKAGE "qtparted"
| #define VERSION "0.4.4"
| #ifdef __cplusplus
| extern "C" void std::exit (int) throw (); using std::exit;
| #endif
| #define STDC_HEADERS 1
| #define HAVE_SYS_TYPES_H 1
| #define HAVE_SYS_STAT_H 1
| #define HAVE_STDLIB_H 1
| #define HAVE_STRING_H 1
| #define HAVE_MEMORY_H 1
| #define HAVE_STRINGS_H 1
| #define HAVE_INTTYPES_H 1
| #define HAVE_STDINT_H 1
| #define HAVE_UNISTD_H 1
| #define HAVE_TEMPLATE_REPOSITORY 1
| #define KDELIBSUFF ""
| #define HAVE_DLFCN_H 1
| #define SIZEOF_SHORT 2
| #define SIZEOF_LONG 8
| #define SIZEOF_INT 4
| #define SIZEOF_VOID_P 8
| #define SIZEOF_LONG_LONG 8
| #define HAVE_LIBUUID 1
| #define HAVE_LIBDL 1
| #define HAVE_LIBPARTED 1
| #define HAVE_LIBREISERFS 1
| #define HAVE_CRYPT 1
| #define ksize_t socklen_t
| #define HAVE_SYS_TYPES_H 1
| #define HAVE_STDINT_H 1
| /* end confdefs.h. */
| #include <CoreAudio/CoreAudio.h>
configure:25114: result: no
configure:25149: checking for CoreAudio/CoreAudio.h
configure:25156: result: no
configure:25174: checking if res_init needs -lresolv
configure:25201: gcc -o conftest -ansi -W -Wall -pedantic -Wshadow -Wpointer-arith -Wmissing-prototypes -Wwrite-strings -D_XOPEN_SOURCE=500 -D_BSD_SOURCE -O2 -g -O2 conftest.c -lreiserfs -lparted -ldl -luuid -lresolv >&5
configure:25207: $? = 0
configure:25211: test -z
|| test ! -s conftest.err
configure:25214: $? = 0
configure:25217: test -s conftest
configure:25220: $? = 0
configure:25224: result: yes
configure:25245: checking if res_init is available
configure:25270: gcc -c -ansi -W -Wall -pedantic -Wshadow -Wpointer-arith -Wmissing-prototypes -Wwrite-strings -D_XOPEN_SOURCE=500 -D_BSD_SOURCE -O2 -g -O2 conftest.c >&5
configure:25276: $? = 0
configure:25280: test -z
|| test ! -s conftest.err
configure:25283: $? = 0
configure:25286: test -s conftest.o
configure:25289: $? = 0
configure:25292: result: yes
configure:25315: checking for killpg in -lucb
configure:25345: gcc -o conftest -ansi -W -Wall -pedantic -Wshadow -Wpointer-arith -Wmissing-prototypes -Wwrite-strings -D_XOPEN_SOURCE=500 -D_BSD_SOURCE -O2 -g -O2 conftest.c -lucb -lreiserfs -lparted -ldl -luuid >&5
/usr/lib64/gcc-lib/x86_64-suse-linux/3.3.5/../../../../x86_64-suse-linux/bin/ld: cannot find -lucb
collect2: ld returned 1 exit status
configure:25351: $? = 1
configure: failed program was:
| /* confdefs.h. */
|
| #define PACKAGE_NAME "qtparted"
| #define PACKAGE_TARNAME "qtparted"
| #define PACKAGE_VERSION "0.4.4"
| #define PACKAGE_STRING "qtparted 0.4.4"
| #define PACKAGE_BUGREPORT "zanac4ever@virgilio.it"
| #define HOMEPAGE "http://qtparted.sourceforge.net/"
| #define PACKAGE "qtparted"
| #define VERSION "0.4.4"
| #ifdef __cplusplus
| extern "C" void std::exit (int) throw (); using std::exit;
| #endif
| #define STDC_HEADERS 1
| #define HAVE_SYS_TYPES_H 1
| #define HAVE_SYS_STAT_H 1
| #define HAVE_STDLIB_H 1
| #define HAVE_STRING_H 1
| #define HAVE_MEMORY_H 1
| #define HAVE_STRINGS_H 1
| #define HAVE_INTTYPES_H 1
| #define HAVE_STDINT_H 1
| #define HAVE_UNISTD_H 1
| #define HAVE_TEMPLATE_REPOSITORY 1
| #define KDELIBSUFF ""
| #define HAVE_DLFCN_H 1
| #define SIZEOF_SHORT 2
| #define SIZEOF_LONG 8
| #define SIZEOF_INT 4
| #define SIZEOF_VOID_P 8
| #define SIZEOF_LONG_LONG 8
| #define HAVE_LIBUUID 1
| #define HAVE_LIBDL 1
| #define HAVE_LIBPARTED 1
| #define HAVE_LIBREISERFS 1
| #define HAVE_CRYPT 1
| #define ksize_t socklen_t
| #define HAVE_SYS_TYPES_H 1
| #define HAVE_STDINT_H 1
| #define HAVE_RES_INIT 1
| #define HAVE_RES_INIT 1
| /* end confdefs.h. */
|
| /* Override any gcc2 internal prototype to avoid an error. */
| #ifdef __cplusplus
| extern "C"
| #endif
| /* We use char because int might match the return type of a gcc2
| builtin and then its argument prototype would still apply. */
| char killpg ();
| int
| main ()
| {
| killpg ();
| ;
| return 0;
| }
configure:25377: result: no
configure:25460: checking for int
configure:25514: result: yes
configure:25517: checking size of int
configure:25867: result: 4
configure:25873: checking for long
configure:25927: result: yes
configure:25930: checking size of long
configure:26280: result: 8
configure:26286: checking for char *
configure:26310: gcc -c -ansi -W -Wall -pedantic -Wshadow -Wpointer-arith -Wmissing-prototypes -Wwrite-strings -D_XOPEN_SOURCE=500 -D_BSD_SOURCE -O2 -g -O2 conftest.c >&5
configure:26316: $? = 0
configure:26320: test -z
|| test ! -s conftest.err
configure:26323: $? = 0
configure:26326: test -s conftest.o
configure:26329: $? = 0
configure:26340: result: yes
configure:26343: checking size of char *
configure:26662: gcc -o conftest -ansi -W -Wall -pedantic -Wshadow -Wpointer-arith -Wmissing-prototypes -Wwrite-strings -D_XOPEN_SOURCE=500 -D_BSD_SOURCE -O2 -g -O2 conftest.c -lreiserfs -lparted -ldl -luuid >&5
conftest.c:79: warning: no previous prototype for `longval'
conftest.c:80: warning: no previous prototype for `ulongval'
configure:26665: $? = 0
configure:26667: ./conftest
./conftest: error while loading shared libraries: libreiserfs-0.3.so.0: cannot open shared object file: No such file or directory
configure:26670: $? = 127
configure: program exited with status 127
configure: failed program was:
| /* confdefs.h. */
|
| #define PACKAGE_NAME "qtparted"
| #define PACKAGE_TARNAME "qtparted"
| #define PACKAGE_VERSION "0.4.4"
| #define PACKAGE_STRING "qtparted 0.4.4"
| #define PACKAGE_BUGREPORT "zanac4ever@virgilio.it"
| #define HOMEPAGE "http://qtparted.sourceforge.net/"
| #define PACKAGE "qtparted"
| #define VERSION "0.4.4"
| #ifdef __cplusplus
| extern "C" void std::exit (int) throw (); using std::exit;
| #endif
| #define STDC_HEADERS 1
| #define HAVE_SYS_TYPES_H 1
| #define HAVE_SYS_STAT_H 1
| #define HAVE_STDLIB_H 1
| #define HAVE_STRING_H 1
| #define HAVE_MEMORY_H 1
| #define HAVE_STRINGS_H 1
| #define HAVE_INTTYPES_H 1
| #define HAVE_STDINT_H 1
| #define HAVE_UNISTD_H 1
| #define HAVE_TEMPLATE_REPOSITORY 1
| #define KDELIBSUFF ""
| #define HAVE_DLFCN_H 1
| #define SIZEOF_SHORT 2
| #define SIZEOF_LONG 8
| #define SIZEOF_INT 4
| #define SIZEOF_VOID_P 8
| #define SIZEOF_LONG_LONG 8
| #define HAVE_LIBUUID 1
| #define HAVE_LIBDL 1
| #define HAVE_LIBPARTED 1
| #define HAVE_LIBREISERFS 1
| #define HAVE_CRYPT 1
| #define ksize_t socklen_t
| #define HAVE_SYS_TYPES_H 1
| #define HAVE_STDINT_H 1
| #define HAVE_RES_INIT 1
| #define HAVE_RES_INIT 1
| #define SIZEOF_INT 4
| #define SIZEOF_LONG 8
| /* end confdefs.h. */
| #include <stdio.h>
| #if HAVE_SYS_TYPES_H
| # include <sys/types.h>
| #endif
| #if HAVE_SYS_STAT_H
| # include <sys/stat.h>
| #endif
| #if STDC_HEADERS
| # include <stdlib.h>
| # include <stddef.h>
| #else
| # if HAVE_STDLIB_H
| # include <stdlib.h>
| # endif
| #endif
| #if HAVE_STRING_H
| # if !STDC_HEADERS && HAVE_MEMORY_H
| # include <memory.h>
| # endif
| # include <string.h>
| #endif
| #if HAVE_STRINGS_H
| # include <strings.h>
| #endif
| #if HAVE_INTTYPES_H
| # include <inttypes.h>
| #else
| # if HAVE_STDINT_H
| # include <stdint.h>
| # endif
| #endif
| #if HAVE_UNISTD_H
| # include <unistd.h>
| #endif
| long longval () { return (long) (sizeof (char *)); }
| unsigned long ulongval () { return (long) (sizeof (char *)); }
| #include <stdio.h>
| #include <stdlib.h>
| int
| main ()
| {
|
| FILE *f = fopen ("conftest.val", "w");
| if (! f)
| exit (1);
| if (((long) (sizeof (char *))) < 0)
| {
| long i = longval ();
| if (i != ((long) (sizeof (char *))))
| exit (1);
| fprintf (f, "%ld\n", i);
| }
| else
| {
| unsigned long i = ulongval ();
| if (i != ((long) (sizeof (char *))))
| exit (1);
| fprintf (f, "%lu\n", i);
| }
| exit (ferror (f) || fclose (f) != 0);
|
| ;
| return 0;
| }
configure:26680: error: cannot compute sizeof (char *), 77
See `config.log' for more details.