g++ -DHAVE_CONFIG_H -I. -I. -I.. -I.. -I/usr/include -I../utils -DNDEBUG -finline-functions -fno-PIC -march=i686 -mcpu=i686 -pipe -Wall -O2 -march=i686 -mtune=pentium4 -pthread -c -o regiontest.o regiontest.cc
Region2D.hh: In member function 'void Region2D<INDEX, SIZE>::Move(REGION&)':
Region2D.hh:155: error: there are no arguments to 'assert' that depend on a template parameter, so a declaration of 'assert' must be available
Region2D.hh:155: error: (if you use '-fpermissive', G++ will accept your code, but allowing the use of an undeclared name is deprecated)
Region2D.hh: In constructor 'Region2D<INDEX, SIZE>::Region2D(Status_t&, const REGION&)':
Region2D.hh:356: error: there are no arguments to 'assert' that depend on a template parameter, so a declaration of 'assert' must be available
Region2D.hh: In member function 'void Region2D<INDEX, SIZE>::Assign(Status_t&, const REGION&)':
Region2D.hh:380: error: there are no arguments to 'assert' that depend on a template parameter, so a declaration of 'assert' must be available
Region2D.hh: In member function 'void Region2D<INDEX, SIZE>::UnionDebug(Status_t&, INDEX, INDEX, INDEX, REGION_TEMP&)':
Region2D.hh:419: error: there are no arguments to 'assert' that depend on a template parameter, so a declaration of 'assert' must be available
Region2D.hh:480: error: there are no arguments to 'assert' that depend on a template parameter, so a declaration of 'assert' must be available
Region2D.hh: In member function 'void Region2D<INDEX, SIZE>::Union(Status_t&, const REGION&)':
Region2D.hh:497: error: there are no arguments to 'assert' that depend on a template parameter, so a declaration of 'assert' must be available
Region2D.hh: In member function 'void Region2D<INDEX, SIZE>::UnionDebug(Status_t&, REGION_O&, REGION_TEMP&)':
Region2D.hh:530: error: there are no arguments to 'assert' that depend on a template parameter, so a declaration of 'assert' must be available
Region2D.hh:596: error: there are no arguments to 'assert' that depend on a template parameter, so a declaration of 'assert' must be available
Region2D.hh: In member function 'void Region2D<INDEX, SIZE>::Subtract(Status_t&, const REGION&)':
Region2D.hh:614: error: there are no arguments to 'assert' that depend on a template parameter, so a declaration of 'assert' must be available
Region2D.hh: In member function 'void Region2D<INDEX, SIZE>::SubtractDebug(Status_t&, REGION_O&, REGION_TEMP&)':
Region2D.hh:648: error: there are no arguments to 'assert' that depend on a template parameter, so a declaration of 'assert' must be available
Region2D.hh:717: error: there are no arguments to 'assert' that depend on a template parameter, so a declaration of 'assert' must be available
Region2D.hh: In member function 'void Region2D<INDEX, SIZE>::FloodFill(Status_t&, CONTROL&, bool)':
Region2D.hh:735: error: there are no arguments to 'assert' that depend on a template parameter, so a declaration of 'assert' must be available
Region2D.hh: In member function 'void Region2D<INDEX, SIZE>::MakeBorder(Status_t&, const REGION&)':
Region2D.hh:888: error: there are no arguments to 'assert' that depend on a template parameter, so a declaration of 'assert' must be available
Region2D.hh: In member function 'void Region2D<INDEX, SIZE>::UnionSurroundingExtents(Status_t&, INDEX, INDEX, INDEX)':
Region2D.hh:922: error: there are no arguments to 'assert' that depend on a template parameter, so a declaration of 'assert' must be available
Region2D.hh: In constructor 'Region2D<INDEX, SIZE>::FloodFillControl<REGION>::FloodFillControl(Status_t&)':
Region2D.hh:978: error: there are no arguments to 'assert' that depend on a template parameter, so a declaration of 'assert' must be available
Region2D.hh: In member function 'void Region2D<INDEX, SIZE>::FloodFillControl<REGION>::Init(Status_t&)':
Region2D.hh:996: error: there are no arguments to 'assert' that depend on a template parameter, so a declaration of 'assert' must be available
make[2]: *** [regiontest.o] Error 1
make[2]: Leaving directory `/usr/src/RPM/BUILD/mjpegtools-1.8.0/y4mdenoise'
make[1]: *** [all-recursive] Error 1
make[1]: Leaving directory `/usr/src/RPM/BUILD/mjpegtools-1.8.0'
make: *** [all] Error 2
make: Leaving directory `/usr/src/RPM/BUILD/mjpegtools-1.8.0'
error: Bad exit status from /usr/src/tmp/rpm-tmp.33008 (%build)