rendered paste bodyMaking all in bin
make[3]: Entering directory `/usr/src/e17/ecore/src/ecore-0.9.9.034/src/bin'
if gcc -DHAVE_CONFIG_H -I. -I. -I../.. -I../../src/lib/ecore -I../../src/lib/ecore_evas -I../../src/lib/e core_directfb -I../../src/lib/ecore_x -I../../src/lib/ecore_fb -I../../src/lib/ecore_job -I../../src/lib/ ecore_con -I../../src/lib/ecore_ipc -I../../src/lib/ecore_txt -I../../src/lib/ecore_config -I../../src/li b/ecore_dbus -I../../src/lib/ecore -I../../src/lib/ecore_evas -I../../src/lib/ecore_directfb -I../../src/ lib/ecore_x -I../../src/lib/ecore_fb -I../../src/lib/ecore_job -I../../src/lib/ecore_con -I../../src/lib/ ecore_ipc -I../../src/lib/ecore_txt -I../../src/lib/ecore_config -I../../src/lib/ecore_dbus -I/usr/X11R6/ include -DPACKAGE_BIN_DIR=\"/opt/e17/bin\" -DPACKAGE_LIB_DIR=\"/opt/e17/lib\" -DPACKAGE_DATA_DIR=\"/opt/e 17/share/ecore\" -march=x86-64 -O2 -pipe -Wall -I../../src/lib/ecore -I../../src/lib/ecore_evas -I../.. /src/lib/ecore_directfb -I../../src/lib/ecore_x -I../../src/lib/ecore_fb -I../../src/lib/ecore_job -I../. ./src/lib/ecore_con -I../../src/lib/ecore_ipc -I../../src/lib/ecore_txt -I../../src/lib/ecore_config -I.. /../src/lib/ecore_dbus -I../../src/lib/ecore -I../../src/lib/ecore_evas -I../../src/lib/ecore_directfb -I ../../src/lib/ecore_x -I../../src/lib/ecore_fb -I../../src/lib/ecore_job -I../../src/lib/ecore_con -I../. ./src/lib/ecore_ipc -I../../src/lib/ecore_txt -I../../src/lib/ecore_config -I../../src/lib/ecore_dbus -I/ usr/X11R6/include -DPACKAGE_BIN_DIR=\"/opt/e17/bin\" -DPACKAGE_LIB_DIR=\"/opt/e17/lib\" -DPACKAGE_DATA_DI R=\"/opt/e17/share/ecore\" -march=x86-64 -O2 -pipe -Wall -MT ecore_evas_test-ecore_evas_test_bg.o -MD -MP -MF ".deps/ecore_evas_test-ecore_evas_test_bg.Tpo" -c -o ecore_evas_test-ecore_evas_test_bg.o `test -f ' ecore_evas_test_bg.c' || echo './'`ecore_evas_test_bg.c; \
then mv -f ".deps/ecore_evas_test-ecore_evas_test_bg.Tpo" ".deps/ecore_evas_test-ecore_evas_test_ bg.Po"; else rm -f ".deps/ecore_evas_test-ecore_evas_test_bg.Tpo"; exit 1; fi
ecore_evas_test_bg.c:447: error: expected declaration specifiers or '...' before 'Evas'
ecore_evas_test_bg.c:447: error: expected declaration specifiers or '...' before 'Evas_Object'
ecore_evas_test_bg.c: In function 'bg_cb_key_up':
ecore_evas_test_bg.c:449: error: 'Evas_Event_Key_Up' undeclared (first use in this function)
ecore_evas_test_bg.c:449: error: (Each undeclared identifier is reported only once
ecore_evas_test_bg.c:449: error: for each function it appears in.)
ecore_evas_test_bg.c:449: error: 'ev' undeclared (first use in this function)
make[3]: *** [ecore_evas_test-ecore_evas_test_bg.o] Error 1
make[3]: Leaving directory `/usr/src/e17/ecore/src/ecore-0.9.9.034/src/bin'
make[2]: *** [all-recursive] Error 1
make[2]: Leaving directory `/usr/src/e17/ecore/src/ecore-0.9.9.034/src'
make[1]: *** [all-recursive] Error 1
make[1]: Leaving directory `/usr/src/e17/ecore/src/ecore-0.9.9.034'
make: *** [all] Error 2