All pastes #210961 Raw Edit

lorddragon make.log

public text v1 · immutable
#210961 ·published 2006-10-20 02:47 UTC
rendered paste body
DKMS make.log for ipw3945-1.0.12-1mdv2007.0 for kernel 2.6.17-5mdv (i586)
Thu Oct 19 22:15:53 EDT 2006
<stdin>:1:28: error: linux/rhconfig.h: No such file or directory
 Using ieee80211 subsystem version 'git-1.1.13' (API v1) from:

 	Base: /lib/modules/2.6.17-5mdv/build/include/
 	Path: /lib/modules/2.6.17-5mdv/build/include/

 EXTRA_CFLAGS = -I/lib/modules/2.6.17-5mdv/build/include/ -DIEEE80211_API_VERSION=1 -g -Wa,-adhlms=check_inc.lst

make -C /lib/modules/2.6.17-5mdv/build M=/var/lib/dkms/ipw3945/1.0.12-1mdv2007.0/build  modules
make[1]: Entering directory `/usr/src/linux-2.6.17-5mdv'

  WARNING: Symbol version dump /usr/src/linux-2.6.17-5mdv/Module.symvers
           is missing; modules will have no dependencies and modversions.

  CC [M]  /var/lib/dkms/ipw3945/1.0.12-1mdv2007.0/build/ipw3945.o
/var/lib/dkms/ipw3945/1.0.12-1mdv2007.0/build/ipw3945.c: In function ‘ipw_send_associate’:
/var/lib/dkms/ipw3945/1.0.12-1mdv2007.0/build/ipw3945.c:4413: error: too few arguments to function ‘ieee80211_tx_frame’
/var/lib/dkms/ipw3945/1.0.12-1mdv2007.0/build/ipw3945.c: In function ‘ipw_bg_daemon_cmd’:
/var/lib/dkms/ipw3945/1.0.12-1mdv2007.0/build/ipw3945.c:4889: error: too few arguments to function ‘ieee80211_tx_frame’
/var/lib/dkms/ipw3945/1.0.12-1mdv2007.0/build/ipw3945.c: In function ‘ipw_auth_work’:
/var/lib/dkms/ipw3945/1.0.12-1mdv2007.0/build/ipw3945.c:9470: error: too few arguments to function ‘ieee80211_tx_frame’
/var/lib/dkms/ipw3945/1.0.12-1mdv2007.0/build/ipw3945.c:9520: error: too few arguments to function ‘ieee80211_tx_frame’
/var/lib/dkms/ipw3945/1.0.12-1mdv2007.0/build/ipw3945.c: In function ‘ipw_handle_probe_request’:
/var/lib/dkms/ipw3945/1.0.12-1mdv2007.0/build/ipw3945.c:9593: error: too few arguments to function ‘ieee80211_tx_frame’
make[2]: *** [/var/lib/dkms/ipw3945/1.0.12-1mdv2007.0/build/ipw3945.o] Error 1
make[1]: *** [_module_/var/lib/dkms/ipw3945/1.0.12-1mdv2007.0/build] Error 2
make[1]: Leaving directory `/usr/src/linux-2.6.17-5mdv'
make: *** [modules] Error 2