rendered paste body/home/mrdocs/cvs/13/Scribus/scribus/chartable.moc:166: error: prototype for ‘void CharTable::selectChar(uint, uint)’ does not match any in class ‘CharTable’
/home/mrdocs/cvs/13/Scribus/scribus/chartable.h:59: error: candidate is: void CharTable::selectChar(uint)
make[2]: *** [scribus/CMakeFiles/scribus.dir/chartable.o] Error 1
make[2]: Leaving directory `/home/mrdocs/cvs/cmaketest'
make[1]: *** [scribus/CMakeFiles/scribus.dir/all] Error 2
make[1]: Leaving directory `/home/mrdocs/cvs/cmaketest'
make: *** [all] Error 2