All pastes #210324 Raw Edit

Enverex

public text v1 · immutable
#210324 ·published 2006-10-19 17:40 UTC
rendered paste body
In file included from GNOME_Panel.h:17,
                 from GNOME_Panel-stubs.c:7:
/usr/include/bonobo-activation-2.0/bonobo-activation/Bonobo_Unknown.h:1:1: warning: null character(s) ignored
/usr/include/bonobo-activation-2.0/bonobo-activation/Bonobo_Unknown.h:1:4342: warning: no newline at end of file
In file included from GNOME_Panel-stubs.c:8:
GNOME_Panel.h:281: error: expected specifier-qualifier-list before ‘POA_Bonobo_Unknown__epv’
GNOME_Panel.h:299: error: expected specifier-qualifier-list before ‘POA_Bonobo_Unknown__epv’
In file included from GNOME_Panel.h:17,
                 from GNOME_Panel-skels.c:7:
/usr/include/bonobo-activation-2.0/bonobo-activation/Bonobo_Unknown.h:1:1: warning: null character(s) ignored
/usr/include/bonobo-activation-2.0/bonobo-activation/Bonobo_Unknown.h:1:4342: warning: no newline at end of file
In file included from GNOME_Panel-skels.c:8:
GNOME_Panel.h:281: error: expected specifier-qualifier-list before ‘POA_Bonobo_Unknown__epv’
GNOME_Panel.h:299: error: expected specifier-qualifier-list before ‘POA_Bonobo_Unknown__epv’
GNOME_Panel-skels.c: In function ‘get_skel_small_GNOME_Vertigo_PanelShell’:
GNOME_Panel-skels.c:15: error: ‘POA_GNOME_Vertigo_PanelShell__vepv’ has no member named ‘GNOME_Vertigo_PanelShell_epv’
GNOME_Panel-skels.c:21: error: ‘POA_GNOME_Vertigo_PanelShell__vepv’ has no member named ‘Bonobo_Unknown_epv’
GNOME_Panel-skels.c:22: error: ‘Bonobo_Unknown__iinterface’ undeclared (first use in this function)
GNOME_Panel-skels.c:22: error: (Each undeclared identifier is reported only once
GNOME_Panel-skels.c:22: error: for each function it appears in.)
GNOME_Panel-skels.c:23: error: ‘_ORBIT_skel_small_Bonobo_Unknown_queryInterface’ undeclared (first use in this function)
GNOME_Panel-skels.c:27: error: ‘POA_GNOME_Vertigo_PanelShell__vepv’ has no member named ‘Bonobo_Unknown_epv’
GNOME_Panel-skels.c:29: error: ‘_ORBIT_skel_small_Bonobo_Unknown_ref’ undeclared (first use in this function)
GNOME_Panel-skels.c:33: error: ‘POA_GNOME_Vertigo_PanelShell__vepv’ has no member named ‘Bonobo_Unknown_epv’
GNOME_Panel-skels.c:35: error: ‘_ORBIT_skel_small_Bonobo_Unknown_unref’ undeclared (first use in this function)
GNOME_Panel-skels.c: In function ‘POA_GNOME_Vertigo_PanelShell__init’:
GNOME_Panel-skels.c:47: warning: implicit declaration of function ‘POA_Bonobo_Unknown__init’
GNOME_Panel-skels.c:50: error: ‘POA_GNOME_Vertigo_PanelShell__vepv’ has no member named ‘GNOME_Vertigo_PanelShell_epv’
GNOME_Panel-skels.c:51: error: ‘Bonobo_Unknown__classid’ undeclared (first use in this function)
GNOME_Panel-skels.c:52: error: ‘POA_GNOME_Vertigo_PanelShell__vepv’ has no member named ‘Bonobo_Unknown_epv’
GNOME_Panel-skels.c: In function ‘POA_GNOME_Vertigo_PanelShell__fini’:
GNOME_Panel-skels.c:58: warning: implicit declaration of function ‘POA_Bonobo_Unknown__fini’
GNOME_Panel-skels.c: In function ‘get_skel_small_GNOME_Vertigo_PanelAppletShell’:
GNOME_Panel-skels.c:68: error: ‘POA_GNOME_Vertigo_PanelAppletShell__vepv’ has no member named ‘GNOME_Vertigo_PanelAppletShell_epv’
GNOME_Panel-skels.c:74: error: ‘POA_GNOME_Vertigo_PanelAppletShell__vepv’ has no member named ‘Bonobo_Unknown_epv’
GNOME_Panel-skels.c:75: error: ‘Bonobo_Unknown__iinterface’ undeclared (first use in this function)
GNOME_Panel-skels.c:76: error: ‘_ORBIT_skel_small_Bonobo_Unknown_queryInterface’ undeclared (first use in this function)
GNOME_Panel-skels.c:80: error: ‘POA_GNOME_Vertigo_PanelAppletShell__vepv’ has no member named ‘Bonobo_Unknown_epv’
GNOME_Panel-skels.c:82: error: ‘_ORBIT_skel_small_Bonobo_Unknown_ref’ undeclared (first use in this function)
GNOME_Panel-skels.c:86: error: ‘POA_GNOME_Vertigo_PanelAppletShell__vepv’ has no member named ‘Bonobo_Unknown_epv’
GNOME_Panel-skels.c:88: error: ‘_ORBIT_skel_small_Bonobo_Unknown_unref’ undeclared (first use in this function)
GNOME_Panel-skels.c: In function ‘POA_GNOME_Vertigo_PanelAppletShell__init’:
GNOME_Panel-skels.c:103: error: ‘POA_GNOME_Vertigo_PanelAppletShell__vepv’ has no member named ‘GNOME_Vertigo_PanelAppletShell_epv’
GNOME_Panel-skels.c:104: error: ‘Bonobo_Unknown__classid’ undeclared (first use in this function)
GNOME_Panel-skels.c:105: error: ‘POA_GNOME_Vertigo_PanelAppletShell__vepv’ has no member named ‘Bonobo_Unknown_epv’
In file included from GNOME_Panel.h:17,
                 from GNOME_Panel-common.c:9:
/usr/include/bonobo-activation-2.0/bonobo-activation/Bonobo_Unknown.h:1:1: warning: null character(s) ignored
/usr/include/bonobo-activation-2.0/bonobo-activation/Bonobo_Unknown.h:1:4342: warning: no newline at end of file
In file included from GNOME_Panel-common.c:10:
GNOME_Panel.h:281: error: expected specifier-qualifier-list before ‘POA_Bonobo_Unknown__epv’
GNOME_Panel.h:299: error: expected specifier-qualifier-list before ‘POA_Bonobo_Unknown__epv’
make[3]: *** [GNOME_Panel-stubs.o] Error 1
make[3]: *** Waiting for unfinished jobs....
make[3]: *** [GNOME_Panel-skels.o] Error 1
make[3]: *** [GNOME_Panel-common.o] Error 1
In file included from ../gnome-panel/GNOME_Panel.h:17,
                 from ../gnome-panel/panel-types.h:7,
                 from panel-typebuiltins.c:175:
/usr/include/bonobo-activation-2.0/bonobo-activation/Bonobo_Unknown.h:1:1: warning: null character(s) ignored
/usr/include/bonobo-activation-2.0/bonobo-activation/Bonobo_Unknown.h:1:4342: warning: no newline at end of file
In file included from ../gnome-panel/panel-types.h:8,
                 from panel-typebuiltins.c:176:
../gnome-panel/GNOME_Panel.h:281: error: expected specifier-qualifier-list before ‘POA_Bonobo_Unknown__epv’
../gnome-panel/GNOME_Panel.h:299: error: expected specifier-qualifier-list before ‘POA_Bonobo_Unknown__epv’
make[3]: *** [panel-typebuiltins.o] Error 1
make[3]: Leaving directory `/var/tmp/portage/gnome-base/gnome-panel-2.16.1/work/gnome-panel-2.16.1/gnome-panel'
make[2]: *** [all] Error 2
make[2]: Leaving directory `/var/tmp/portage/gnome-base/gnome-panel-2.16.1/work/gnome-panel-2.16.1/gnome-panel'
make[1]: *** [all-recursive] Error 1
make[1]: Leaving directory `/var/tmp/portage/gnome-base/gnome-panel-2.16.1/work/gnome-panel-2.16.1'
make: *** [all] Error 2

!!! ERROR: gnome-base/gnome-panel-2.16.1 failed.
Call stack:
  ebuild.sh, line 1568:   Called dyn_compile
  ebuild.sh, line 937:   Called src_compile
  ebuild.sh, line 1261:   Called gnome2_src_compile
  gnome2.eclass, line 64:   Called die