[INFO] Scanning for projects...
[INFO] ----------------------------------------------------------------------------
[INFO] Building Geronimo :: Jetty :: Builder
[INFO] task-segment: [clean, install]
[INFO] ----------------------------------------------------------------------------
[INFO] [clean:clean]
[INFO] Deleting directory C:\java\geronimo\server\trunk\modules\geronimo-jetty-builder\target
[INFO] Deleting directory C:\java\geronimo\server\trunk\modules\geronimo-jetty-builder\target\classes
[INFO] Deleting directory C:\java\geronimo\server\trunk\modules\geronimo-jetty-builder\target\test-classes
[INFO] [tools:require-java-version {execution: validate-java-version}]
[WARNING]
Artifact junit:junit:jar:3.8.1:test retains local scope 'test' overriding broader scope 'compile'
given by a dependency. If this is not intended, modify or remove the local scope.
[INFO] [xmlbeans:xmlbeans {execution: default}]
IO Error java.io.FileNotFoundException: C:\java\geronimo\server\trunk\modules\geronimo-jetty-builder\src\main\schema\geronimo-application-1.2.xsd (The system cannot find the file specified)
Time to build schema type system: 0.813 seconds
BUILD FAILED
[INFO] ------------------------------------------------------------------------
[ERROR] BUILD ERROR
[INFO] ------------------------------------------------------------------------
[INFO] XmlBeans compile failed:
xml ErrorLoading schema file C:\java\geronimo\server\trunk\modules\geronimo-jetty-builder\src\main\schema\geronimo-jetty-1.2.xsd
xml ErrorLoading schema file C:\java\geronimo\server\trunk\modules\geronimo-jetty-builder\src\main\schema\geronimo-jetty-config-1.0.xsd
xml ErrorLoading config file C:\java\geronimo\server\trunk\modules\geronimo-jetty-builder\src\main\schema\xmlconfig.xml
xml ErrorC:\java\geronimo\server\trunk\modules\geronimo-jetty-builder\src\main\schema\geronimo-jetty-1.2.xsd:33: error: java.io.FileNotFoundException: C:\java\geronimo\server\trunk\modules\geronimo-je
tty-builder\src\main\schema\geronimo-application-1.2.xsd (The system cannot find the file specified)
xml ErrorC:\java\geronimo\server\trunk\modules\geronimo-jetty-builder\src\main\schema\geronimo-jetty-1.2.xsd:45: error: src-resolve: element 'clustering@http://geronimo.apache.org/xml/ns/j2ee/applicat
ion-1.2' not found.
xml ErrorC:\java\geronimo\server\trunk\modules\geronimo-jetty-builder\src\main\schema\geronimo-jetty-1.2.xsd:58: error: src-resolve: element 'security@http://geronimo.apache.org/xml/ns/j2ee/applicatio
n-1.2' not found.
[INFO] ------------------------------------------------------------------------
[INFO] For more information, run Maven with the -e switch
[INFO] ------------------------------------------------------------------------
[INFO] Total time: 7 seconds
[INFO] Finished at: Thu Oct 19 01:25:51 CEST 2006
[INFO] Final Memory: 18M/33M
[INFO] ------------------------------------------------------------------------