make[2]: Entering directory `/download/mono-1-1-18/mono/mono/tests/cas'
make[2]: Nothing to be done for `all-am'.
make[2]: Leaving directory `/download/mono-1-1-18/mono/mono/tests/cas'
make[1]: Leaving directory `/download/mono-1-1-18/mono/mono/tests/cas'
make[1]: Entering directory `/download/mono-1-1-18/mono/mono/tests'
if /bin/bash ../../libtool --mode=compile --tag=CC gcc -mno-cygwin -g -DHAVE_CONFIG_H -I. -I. -I../.. -Ik:/mono
/Mono-1.1.18/include/glib-2.0 -Ik:/mono/Mono-1.1.18/lib/glib-2.0/include -I/usr/local/include -DWIN32_THREAD
S -DFD_SETSIZE=1024 -fno-optimize-sibling-calls -g -O2 -fno-strict-aliasing -g -Wall -Wunused -Wmissing-prototy
pes -Wmissing-declarations -Wstrict-prototypes -Wmissing-prototypes -Wnested-externs -Wpointer-arith -Wno-cast
-qual -Wcast-align -Wwrite-strings -MT libtest_la-libtest.lo -MD -MP -MF ".deps/libtest_la-libtest.Tpo" -c -o l
ibtest_la-libtest.lo `test -f 'libtest.c' || echo './'`libtest.c; \
then mv -f ".deps/libtest_la-libtest.Tpo" ".deps/libtest_la-libtest.Plo"; else rm -f ".deps/libtest_la-libtest.
Tpo"; exit 1; fi
gcc -mno-cygwin -g -DHAVE_CONFIG_H -I. -I. -I../.. -Ik:/mono/Mono-1.1.18/include/glib-2.0 -Ik:/mono/Mono-1.1.1
8/lib/glib-2.0/include -I/usr/local/include -DWIN32_THREADS -DFD_SETSIZE=1024 -fno-optimize-sibling-calls -g -O
2 -fno-strict-aliasing -g -Wall -Wunused -Wmissing-prototypes -Wmissing-declarations -Wstrict-prototypes -Wmiss
ing-prototypes -Wnested-externs -Wpointer-arith -Wno-cast-qual -Wcast-align -Wwrite-strings -MT libtest_la-libt
est.lo -MD -MP -MF .deps/libtest_la-libtest.Tpo -c libtest.c -DPIC -o .libs/libtest_la-libtest.o
libtest.c:36: warning: no previous prototype for `test_lpwstr_marshal'
libtest.c:62: warning: no previous prototype for `mono_union_test_1'
libtest.c:68: warning: no previous prototype for `mono_return_int'
libtest.c:79: warning: no previous prototype for `mono_return_int_ss'
libtest.c:85: warning: no previous prototype for `mono_return_ss'
libtest.c:97: warning: no previous prototype for `mono_return_sc1'
libtest.c:110: warning: no previous prototype for `mono_return_sc3'
libtest.c:124: warning: no previous prototype for `mono_return_sc5'
libtest.c:141: warning: no previous prototype for `mono_return_int_su'
libtest.c:170: warning: no previous prototype for `mono_test_many_byte_arguments'
libtest.c:176: warning: no previous prototype for `mono_test_many_float_arguments'
libtest.c:182: warning: no previous prototype for `mono_test_many_double_arguments'
libtest.c:188: warning: no previous prototype for `mono_test_split_double_arguments'
libtest.c:194: warning: no previous prototype for `mono_test_puts_static'
libtest.c:203: warning: no previous prototype for `mono_invoke_delegate'
libtest.c:217: warning: no previous prototype for `mono_test_marshal_char'
libtest.c:226: warning: no previous prototype for `mono_test_marshal_char_array'
libtest.c:241: warning: no previous prototype for `mono_test_empty_pinvoke'
libtest.c:247: warning: no previous prototype for `mono_test_marshal_bool_byref'
libtest.c:257: warning: no previous prototype for `mono_test_marshal_array'
libtest.c:268: warning: no previous prototype for `mono_test_marshal_inout_array'
libtest.c:281: warning: no previous prototype for `mono_test_marshal_out_array'
libtest.c:293: warning: no previous prototype for `mono_test_marshal_inout_nonblittable_array'
libtest.c:318: warning: no previous prototype for `mono_test_return_vtype'
libtest.c:333: warning: no previous prototype for `mono_test_delegate_struct'
libtest.c:341: warning: no previous prototype for `mono_test_return_string'
libtest.c:357: warning: no previous prototype for `mono_test_ref_vtype'
libtest.c:375: warning: no previous prototype for `mono_test_marshal_out_struct'
libtest.c:394: warning: no previous prototype for `mono_test_marshal_delegate_struct'
libtest.c:406: warning: no previous prototype for `mono_test_marshal_struct'
libtest.c:416: warning: no previous prototype for `mono_test_marshal_byref_struct'
libtest.c:440: warning: no previous prototype for `mono_test_marshal_struct2'
libtest.c:452: warning: no previous prototype for `mono_test_marshal_struct2_2'
libtest.c:465: warning: no previous prototype for `mono_test_marshal_lpstruct'
libtest.c:475: warning: no previous prototype for `mono_test_marshal_lpstruct_blittable'
libtest.c:484: warning: no previous prototype for `mono_test_marshal_struct_array'
libtest.c:506: warning: no previous prototype for `mono_test_marshal_long_align_struct_array'
libtest.c:512: warning: no previous prototype for `mono_test_marshal_class'
libtest.c:533: warning: no previous prototype for `mono_test_marshal_byref_class'
libtest.c:563: warning: no previous prototype for `reliable_delegate'
libtest.c:584: warning: no previous prototype for `mono_test_marshal_delegate'
libtest.c:600: warning: no previous prototype for `mono_test_marshal_return_delegate'
libtest.c:612: warning: function declaration isn't a prototype
libtest.c:633: warning: no previous prototype for `mono_test_marshal_delegate2'
libtest.c:653: warning: no previous prototype for `mono_test_marshal_delegate4'
libtest.c:683: warning: no previous prototype for `mono_test_marshal_delegate5'
libtest.c:707: warning: no previous prototype for `mono_test_marshal_delegate6'
libtest.c:719: warning: no previous prototype for `mono_test_marshal_delegate7'
libtest.c:740: warning: no previous prototype for `mono_test_marshal_inout_byval_class_delegate'
libtest.c:763: warning: no previous prototype for `mono_test_marshal_delegate8'
libtest.c:772: warning: no previous prototype for `mono_test_marshal_delegate9'
libtest.c:784: warning: no previous prototype for `mono_test_marshal_delegate10'
libtest.c:792: warning: no previous prototype for `mono_test_marshal_primitive_byref_delegate'
libtest.c:811: warning: no previous prototype for `mono_test_marshal_return_delegate_delegate'
libtest.c:817: warning: no previous prototype for `mono_test_marshal_stringbuilder'
libtest.c:829: warning: no previous prototype for `mono_test_marshal_stringbuilder_default'
libtest.c:839: warning: no previous prototype for `mono_test_marshal_stringbuilder_unicode'
libtest.c:864: warning: no previous prototype for `mono_test_marshal_empty_string_array'
libtest.c:870: warning: no previous prototype for `mono_test_marshal_string_array'
libtest.c:884: warning: no previous prototype for `mono_test_marshal_byref_string_array'
libtest.c:900: warning: no previous prototype for `mono_test_marshal_stringbuilder_array'
libtest.c:914: warning: no previous prototype for `mono_test_marshal_unicode_string_array'
libtest.c:946: warning: no previous prototype for `mono_test_empty_struct'
libtest.c:965: warning: no previous prototype for `mono_test_byvalstr_gen'
libtest.c:977: warning: no previous prototype for `mono_test_byvalstr_check'
libtest.c:990: warning: no previous prototype for `NameManglingAnsi'
libtest.c:996: warning: no previous prototype for `NameManglingAnsiA'
libtest.c:1002: warning: no previous prototype for `NameManglingAnsiW'
libtest.c:1008: warning: no previous prototype for `NameManglingAnsi2A'
libtest.c:1014: warning: no previous prototype for `NameManglingAnsi2W'
libtest.c:1020: warning: no previous prototype for `NameManglingUnicode'
libtest.c:1026: warning: no previous prototype for `NameManglingUnicodeW'
libtest.c:1032: warning: no previous prototype for `NameManglingUnicode2'
libtest.c:1038: warning: no previous prototype for `NameManglingAutoW'
libtest.c:1048: warning: no previous prototype for `NameManglingAuto'
libtest.c:1060: warning: no previous prototype for `callFunction'
libtest.c:1071: warning: no previous prototype for `class_marshal_test0'
libtest.c:1084: warning: no previous prototype for `class_marshal_test4'
libtest.c:1093: warning: no previous prototype for `class_marshal_test1'
libtest.c:1104: warning: no previous prototype for `class_marshal_test2'
libtest.c:1117: warning: no previous prototype for `string_marshal_test0'
libtest.c:1126: warning: no previous prototype for `string_marshal_test1'
libtest.c:1132: warning: no previous prototype for `string_marshal_test2'
libtest.c:1143: warning: no previous prototype for `string_marshal_test3'
libtest.c:1157: warning: no previous prototype for `TestBlittableClass'
libtest.c:1185: warning: no previous prototype for `MyGetVersionEx'
libtest.c:1197: warning: no previous prototype for `BugGetVersionEx'
libtest.c:1209: warning: no previous prototype for `mono_test_marshal_point'
libtest.c:1224: warning: no previous prototype for `mono_test_marshal_mixed_point'
libtest.c:1234: warning: no previous prototype for `mono_test_marshal_mixed_point_2'
libtest.c:1246: warning: no previous prototype for `marshal_test_ref_bool'
libtest.c:1272: warning: no previous prototype for `marshal_test_bool_struct'
libtest.c:1290: warning: no previous prototype for `mono_test_last_error'
libtest.c:1300: warning: no previous prototype for `mono_test_asany'
libtest.c:1347: warning: no previous prototype for `mono_test_marshal_asany_inout'
libtest.c:1372: warning: no previous prototype for `mono_test_marshal_amd64_pass_return_struct1'
libtest.c:1388: warning: no previous prototype for `mono_test_marshal_amd64_pass_return_struct2'
libtest.c:1401: warning: no previous prototype for `mono_test_marshal_amd64_pass_return_struct3'
libtest.c:1413: warning: no previous prototype for `mono_test_marshal_amd64_pass_return_struct4'
libtest.c:1429: warning: no previous prototype for `mono_test_marshal_ia64_pass_return_struct5'
libtest.c:1442: warning: no previous prototype for `mono_test_marshal_ia64_pass_return_struct6'
libtest.c:1453: warning: no previous prototype for `mono_test_marshal_pass_return_custom'
libtest.c:1463: warning: no previous prototype for `mono_test_marshal_pass_out_custom'
libtest.c:1474: warning: no previous prototype for `mono_test_marshal_pass_inout_custom'
libtest.c:1483: warning: no previous prototype for `mono_test_marshal_pass_out_byval_custom'
libtest.c:1489: warning: no previous prototype for `mono_test_marshal_pass_byref_custom'
libtest.c:1497: warning: no previous prototype for `mono_test_marshal_pass_return_custom2'
libtest.c:1505: warning: no previous prototype for `mono_test_marshal_pass_return_custom_null'
libtest.c:1515: warning: no previous prototype for `mono_test_marshal_pass_return_custom_in_delegate'
libtest.c:1538: warning: no previous prototype for `mono_test_marshal_pass_return_custom_null_in_delegate'
libtest.c:1548: warning: no previous prototype for `mono_test_marshal_return_enum_delegate'
libtest.c:1561: warning: no previous prototype for `mono_test_marshal_blittable_struct_delegate'
libtest.c:1578: warning: no previous prototype for `mono_test_stdcall_name_mangling'
libtest.c:1594: warning: no previous prototype for `mono_test_marshal_small_struct_delegate1'
libtest.c:1614: warning: no previous prototype for `mono_test_marshal_small_struct_delegate2'
libtest.c:1636: warning: no previous prototype for `mono_test_marshal_small_struct_delegate3'
libtest.c:1657: warning: no previous prototype for `mono_test_marshal_small_struct_delegate4'
libtest.c:1677: warning: no previous prototype for `mono_test_marshal_small_struct_delegate5'
libtest.c:1697: warning: no previous prototype for `mono_test_marshal_small_struct_delegate6'
libtest.c:1719: warning: no previous prototype for `mono_test_marshal_small_struct_delegate7'
libtest.c:1740: warning: no previous prototype for `mono_test_marshal_small_struct_delegate8'
libtest.c:1760: warning: no previous prototype for `mono_test_marshal_small_struct_delegate9'
libtest.c:1780: warning: no previous prototype for `mono_test_marshal_small_struct_delegate10'
libtest.c:1802: warning: no previous prototype for `mono_test_marshal_small_struct_delegate11'
libtest.c:1819: warning: no previous prototype for `mono_test_marshal_array_delegate'
libtest.c:1825: warning: no previous prototype for `mono_test_marshal_out_array_delegate'
libtest.c:1836: warning: no previous prototype for `mono_test_marshal_out_string_array_delegate'
libtest.c:1849: warning: no previous prototype for `mono_test_marshal_cdecl_delegate'
libtest.c:1862: warning: no previous prototype for `mono_test_marshal_return_string_array_delegate'
libtest.c:1881: warning: no previous prototype for `add_delegate'
libtest.c:1887: warning: no previous prototype for `mono_test_marshal_return_fnptr'
libtest.c:1899: warning: no previous prototype for `mono_test_marshal_bstr_in'
libtest.c:1907: warning: no previous prototype for `mono_test_marshal_bstr_out'
libtest.c:1914: warning: no previous prototype for `mono_test_marshal_bstr_in_null'
libtest.c:1922: warning: no previous prototype for `mono_test_marshal_bstr_out_null'
libtest.c:1929: warning: no previous prototype for `mono_test_marshal_variant_in_sbyte'
libtest.c:1937: warning: no previous prototype for `mono_test_marshal_variant_in_byte'
libtest.c:1945: warning: no previous prototype for `mono_test_marshal_variant_in_short'
libtest.c:1953: warning: no previous prototype for `mono_test_marshal_variant_in_ushort'
libtest.c:1961: warning: no previous prototype for `mono_test_marshal_variant_in_int'
libtest.c:1969: warning: no previous prototype for `mono_test_marshal_variant_in_uint'
libtest.c:1977: warning: no previous prototype for `mono_test_marshal_variant_in_long'
libtest.c: In function `mono_test_marshal_variant_in_long':
libtest.c:1978: error: structure has no member named `llVal'
libtest.c: At top level:
libtest.c:1985: warning: no previous prototype for `mono_test_marshal_variant_in_ulong'
libtest.c: In function `mono_test_marshal_variant_in_ulong':
libtest.c:1986: error: structure has no member named `ullVal'
libtest.c: At top level:
libtest.c:1993: warning: no previous prototype for `mono_test_marshal_variant_in_float'
libtest.c:2001: warning: no previous prototype for `mono_test_marshal_variant_in_double'
libtest.c:2009: warning: no previous prototype for `mono_test_marshal_variant_in_bstr'
libtest.c:2017: warning: no previous prototype for `mono_test_marshal_variant_out_sbyte'
libtest.c:2026: warning: no previous prototype for `mono_test_marshal_variant_out_byte'
libtest.c:2035: warning: no previous prototype for `mono_test_marshal_variant_out_short'
libtest.c:2044: warning: no previous prototype for `mono_test_marshal_variant_out_ushort'
libtest.c:2053: warning: no previous prototype for `mono_test_marshal_variant_out_int'
libtest.c:2062: warning: no previous prototype for `mono_test_marshal_variant_out_uint'
libtest.c:2071: warning: no previous prototype for `mono_test_marshal_variant_out_long'
libtest.c: In function `mono_test_marshal_variant_out_long':
libtest.c:2073: error: structure has no member named `llVal'
libtest.c: At top level:
libtest.c:2080: warning: no previous prototype for `mono_test_marshal_variant_out_ulong'
libtest.c: In function `mono_test_marshal_variant_out_ulong':
libtest.c:2082: error: structure has no member named `ullVal'
libtest.c: At top level:
libtest.c:2089: warning: no previous prototype for `mono_test_marshal_variant_out_float'
libtest.c:2098: warning: no previous prototype for `mono_test_marshal_variant_out_double'
libtest.c:2107: warning: no previous prototype for `mono_test_marshal_variant_out_bstr'
libtest.c:2139: warning: `IID_IMath' initialized and declared `extern'
libtest.c:2140: warning: `IID_IMonoUnknown' initialized and declared `extern'
libtest.c:2141: warning: `IID_IMonoDispatch' initialized and declared `extern'
libtest.c:2144: warning: no previous prototype for `MonoQueryInterface'
libtest.c:2162: warning: no previous prototype for `MonoAddRef'
libtest.c:2167: warning: no previous prototype for `MonoRelease'
libtest.c:2172: warning: no previous prototype for `Add'
libtest.c:2178: warning: no previous prototype for `Subtract'
libtest.c:2187: warning: no previous prototype for `Same'
libtest.c:2195: warning: no previous prototype for `Different'
libtest.c:2217: warning: no previous prototype for `mono_test_marshal_com_object_create'
libtest.c:2225: warning: no previous prototype for `mono_test_marshal_com_object_destroy'
libtest.c:2235: warning: no previous prototype for `mono_test_marshal_com_object_ref_count'
make[1]: *** [libtest_la-libtest.lo] Error 1
make[1]: Leaving directory `/download/mono-1-1-18/mono/mono/tests'
make: *** [all-recursive] Error 1
martinf@ftm01dev /download/mono-1-1-18/mono/mono/tests
$