All pastes #206986 Raw Edit

Untitled

public text v1 · immutable
#206986 ·published 2006-10-17 18:30 UTC
rendered paste body
make -C  /home/z/trunk/build_mipsel/linux-2.4-ar7/avalanche-cpmac-0.1 CFLAGS="-D__KERNEL__ -I/home/z/trunk/build_mipsel/linux-2.4-ar7/linux-2.4.32/include -Wall -Wstrict-prototypes -Wno-trigraphs -Os -fno-strict-aliasing -fno-common -fno-builtin-sprintf -fomit-frame-pointer   -funit-at-a-time -I /home/z/trunk/build_mipsel/linux-2.4-ar7/linux-2.4.32/include/asm/gcc -G 0 -mno-abicalls -fno-pic -pipe  -finline-limit=100000 -mabi=32 -march=mips32 -Wa,-32 -Wa,-march=mips32 -Wa,-mips32 -Wa,--trap -DMODULE -mlong-calls -fno-common" MAKING_MODULES=1 modules
make[6]: Entering directory `/home/z/trunk/build_mipsel/linux-2.4-ar7/avalanche-cpmac-0.1'
Makefile:14: warning: overriding commands for target `avalanche_cpmac.o'
/home/z/trunk/build_mipsel/linux-2.4-ar7/linux-2.4.32/Rules.make:97: warning: ignoring old commands for target `avalanche_cpmac.o'
mipsel-linux-uclibc-gcc -D__KERNEL__ -I/home/z/trunk/build_mipsel/linux-2.4-ar7/linux-2.4.32/include -Wall -Wstrict-prototypes -Wno-trigraphs -Os -fno-strict-aliasing -fno-common -fno-builtin-sprintf -fomit-frame-pointer   -funit-at-a-time -I /home/z/trunk/build_mipsel/linux-2.4-ar7/linux-2.4.32/include/asm/gcc -G 0 -mno-abicalls -fno-pic -pipe  -finline-limit=100000 -mabi=32 -march=mips32 -Wa,-32 -Wa,-march=mips32 -Wa,-mips32 -Wa,--trap -DMODULE -mlong-calls -fno-common -DCONFIG_AVALANCHE_CPMAC_AUTO -DCONFIG_MIPS_CPMAC_INIT_BUF_MALLOC -nostdinc -iwithprefix include -DKBUILD_BASENAME=cpmac  -c -o cpmac.o cpmac.c
In file included from cpmacHalLx.h:38,
                 from cpmac.c:40:
cpswhal_cpmac.h:379: warning: useless keyword or type name in empty declaration
cpswhal_cpmac.h:379: warning: empty declaration
cpswhal_cpmac.h:382: warning: useless keyword or type name in empty declaration
cpswhal_cpmac.h:382: warning: empty declaration
cpmac.c: In function `ti_skb_release_fragment':
cpmac.c:353: warning: implicit declaration of function `skb_drop_fraglist'
cpmac.c: In function `cpmac_hal_control':
cpmac.c:2137: warning: unused variable `mdix'
cpmac.c: In function `cpmac_dev_probe':
cpmac.c:2323: error: `CONFIG_MIPS_CPMAC_PORTS' undeclared (first use in this function)
cpmac.c:2323: error: (Each undeclared identifier is reported only once
cpmac.c:2323: error: for each function it appears in.)
cpmac.c: At top level:
cpmac.c:366: warning: 'ti_skb_release_data' defined but not used
make[6]: *** [cpmac.o] Error 1
make[6]: Leaving directory `/home/z/trunk/build_mipsel/linux-2.4-ar7/avalanche-cpmac-0.1'
make[5]: *** [_mod_/home/z/trunk/build_mipsel/linux-2.4-ar7/avalanche-cpmac-0.1] Error 2
make[5]: Leaving directory `/home/z/trunk/build_mipsel/linux-2.4-ar7/linux-2.4.32'
make[4]: *** [/home/z/trunk/build_mipsel/linux-2.4-ar7/avalanche-cpmac-0.1/.built] Error 2
make[4]: Leaving directory `/home/z/trunk/package/ar7-net'
make[3]: *** [ar7-net-compile] Error 2
make[3]: Leaving directory `/home/z/trunk/package'
make[2]: *** [compile] Error 2
make[2]: Leaving directory `/home/z/trunk/package'
make[1]: *** [package/compile] Error 2
make[1]: Leaving directory `/home/z/trunk'
make: *** [world] Error 2
root@ZPC:/home/z/trunk#