All pastes #206845 Raw Edit

Mine

public text v1 · immutable
#206845 ·published 2006-10-17 16:35 UTC
rendered paste body
[root@vplaptop scr24x_2.6.x_v4.2.2]# ./install
Kernel Headers located.
Kernel module has to be recompiled
Library is in /usr/lib
Installing ........
rm -f *.o
rm -f *.ko
rm -f *.mod.*
rm -f .*.cmd
rm -rf .tmp_*
rm -f *~
Compilng Release mode kernel module
make -C /lib/modules/`uname -r`/build SUBDIRS=`pwd` modules
make[1]: Entering directory `/usr/src/linux-2.6.17-5mdv'

  WARNING: Symbol version dump /usr/src/linux-2.6.17-5mdv/Module.symvers
           is missing; modules will have no dependencies and modversions.

  CC [M]  /home/laur/Desktop/scr24x_v4.2.2/scr24x_2.6.x_v4.2.2/src/scr241_main.o
In file included from /home/laur/Desktop/scr24x_v4.2.2/scr24x_2.6.x_v4.2.2/src/i
ncludes.h:114,
                 from /home/laur/Desktop/scr24x_v4.2.2/scr24x_2.6.x_v4.2.2/src/s
cr241_main.c:49:
/home/laur/Desktop/scr24x_v4.2.2/scr24x_2.6.x_v4.2.2/src/pcsc.h:234: error: expe
cted specifier-qualifier-list before ‘dev_link_t’
/home/laur/Desktop/scr24x_v4.2.2/scr24x_2.6.x_v4.2.2/src/scr241_main.c:65: error
: expected ‘=’, ‘,’, ‘;’, ‘asm’ or ‘__attribute__’ before ‘*’ token
/home/laur/Desktop/scr24x_v4.2.2/scr24x_2.6.x_v4.2.2/src/scr241_main.c:128: erro
r: expected ‘)’ before ‘*’ token
/home/laur/Desktop/scr24x_v4.2.2/scr24x_2.6.x_v4.2.2/src/scr241_main.c: In funct
ion ‘Driver_Attach’:
/home/laur/Desktop/scr24x_v4.2.2/scr24x_2.6.x_v4.2.2/src/scr241_main.c:200: erro
r: ‘dev_link_t’ undeclared (first use in this function)
/home/laur/Desktop/scr24x_v4.2.2/scr24x_2.6.x_v4.2.2/src/scr241_main.c:200: erro
r: (Each undeclared identifier is reported only once
/home/laur/Desktop/scr24x_v4.2.2/scr24x_2.6.x_v4.2.2/src/scr241_main.c:200: erro
r: for each function it appears in.)
/home/laur/Desktop/scr24x_v4.2.2/scr24x_2.6.x_v4.2.2/src/scr241_main.c:200: erro
r: ‘pDeviceLink’ undeclared (first use in this function)
/home/laur/Desktop/scr24x_v4.2.2/scr24x_2.6.x_v4.2.2/src/scr241_main.c:201: warn
ing: ISO C90 forbids mixed declarations and code
/home/laur/Desktop/scr24x_v4.2.2/scr24x_2.6.x_v4.2.2/src/scr241_main.c:212: erro
r: expected expression before ‘)’ token
/home/laur/Desktop/scr24x_v4.2.2/scr24x_2.6.x_v4.2.2/src/scr241_main.c:220: erro
r: ‘DEVICE_EXTENSION’ has no member named ‘pucDeviceName’
/home/laur/Desktop/scr24x_v4.2.2/scr24x_2.6.x_v4.2.2/src/scr241_main.c:221: erro
r: ‘DEVICE_EXTENSION’ has no member named ‘pucDeviceName’
/home/laur/Desktop/scr24x_v4.2.2/scr24x_2.6.x_v4.2.2/src/scr241_main.c:229: erro
r: ‘DEVICE_EXTENSION’ has no member named ‘DeviceLink’
/home/laur/Desktop/scr24x_v4.2.2/scr24x_2.6.x_v4.2.2/src/scr241_main.c:231: erro
r: ‘DEVICE_EXTENSION’ has no member named ‘CardTracker’
/home/laur/Desktop/scr24x_v4.2.2/scr24x_2.6.x_v4.2.2/src/scr241_main.c:236: erro
r: ‘DEVICE_EXTENSION’ has no member named ‘nMajorNumber’
/home/laur/Desktop/scr24x_v4.2.2/scr24x_2.6.x_v4.2.2/src/scr241_main.c:238: erro
r: ‘DEVICE_EXTENSION’ has no member named ‘bBootRomPresent’
/home/laur/Desktop/scr24x_v4.2.2/scr24x_2.6.x_v4.2.2/src/scr241_main.c:239: erro
r: ‘DEVICE_EXTENSION’ has no member named ‘bIsPolledMode’
/home/laur/Desktop/scr24x_v4.2.2/scr24x_2.6.x_v4.2.2/src/scr241_main.c:245: erro
r: ‘DEVICE_EXTENSION’ has no member named ‘bIsSystemResume’
/home/laur/Desktop/scr24x_v4.2.2/scr24x_2.6.x_v4.2.2/src/scr241_main.c:247: erro
r: ‘DEVICE_EXTENSION’ has no member named ‘pucDeviceName’
/home/laur/Desktop/scr24x_v4.2.2/scr24x_2.6.x_v4.2.2/src/scr241_main.c:250: erro
r: ‘DEVICE_EXTENSION’ has no member named ‘nMajorNumber’
/home/laur/Desktop/scr24x_v4.2.2/scr24x_2.6.x_v4.2.2/src/scr241_main.c:252: erro
r: ‘DEVICE_EXTENSION’ has no member named ‘tqsEventWait’
/home/laur/Desktop/scr24x_v4.2.2/scr24x_2.6.x_v4.2.2/src/scr241_main.c:253: erro
r: ‘DEVICE_EXTENSION’ has no member named ‘tqsReadEventWait’
/home/laur/Desktop/scr24x_v4.2.2/scr24x_2.6.x_v4.2.2/src/scr241_main.c:282: erro
r: ‘struct pcmcia_device’ has no member named ‘instance’
/home/laur/Desktop/scr24x_v4.2.2/scr24x_2.6.x_v4.2.2/src/scr241_main.c:284: erro
r: ‘DEV_PRESENT’ undeclared (first use in this function)
/home/laur/Desktop/scr24x_v4.2.2/scr24x_2.6.x_v4.2.2/src/scr241_main.c:284: erro
r: ‘DEV_CONFIG_PENDING’ undeclared (first use in this function)
/home/laur/Desktop/scr24x_v4.2.2/scr24x_2.6.x_v4.2.2/src/scr241_main.c:285: warn
ing: implicit declaration of function ‘Driver_Config’
/home/laur/Desktop/scr24x_v4.2.2/scr24x_2.6.x_v4.2.2/src/scr241_main.c: In funct
ion ‘Driver_Detach’:
/home/laur/Desktop/scr24x_v4.2.2/scr24x_2.6.x_v4.2.2/src/scr241_main.c:295: erro
r: ‘dev_link_t’ undeclared (first use in this function)
/home/laur/Desktop/scr24x_v4.2.2/scr24x_2.6.x_v4.2.2/src/scr241_main.c:295: erro
r: ‘pDeviceLink’ undeclared (first use in this function)
/home/laur/Desktop/scr24x_v4.2.2/scr24x_2.6.x_v4.2.2/src/scr241_main.c:295: warn
ing: implicit declaration of function ‘dev_to_instance’
/home/laur/Desktop/scr24x_v4.2.2/scr24x_2.6.x_v4.2.2/src/scr241_main.c:296: warn
ing: ISO C90 forbids mixed declarations and code
/home/laur/Desktop/scr24x_v4.2.2/scr24x_2.6.x_v4.2.2/src/scr241_main.c:308: erro
r: ‘struct _DEVICE_EXTENSION’ has no member named ‘DeviceLink’
/home/laur/Desktop/scr24x_v4.2.2/scr24x_2.6.x_v4.2.2/src/scr241_main.c:323: erro
r: ‘DEV_PRESENT’ undeclared (first use in this function)
/home/laur/Desktop/scr24x_v4.2.2/scr24x_2.6.x_v4.2.2/src/scr241_main.c:325: erro
r: ‘DEV_STALE_CONFIG’ undeclared (first use in this function)
/home/laur/Desktop/scr24x_v4.2.2/scr24x_2.6.x_v4.2.2/src/scr241_main.c:327: erro
r: ‘DEV_CONFIG’ undeclared (first use in this function)
/home/laur/Desktop/scr24x_v4.2.2/scr24x_2.6.x_v4.2.2/src/scr241_main.c:329: erro
r: ‘DEVICE_EXTENSION’ has no member named ‘nStop’
/home/laur/Desktop/scr24x_v4.2.2/scr24x_2.6.x_v4.2.2/src/scr241_main.c:335: warn
ing: implicit declaration of function ‘pcmcia_release_configuration’
/home/laur/Desktop/scr24x_v4.2.2/scr24x_2.6.x_v4.2.2/src/scr241_main.c:343: warn
ing: implicit declaration of function ‘pcmcia_release_irq’
/home/laur/Desktop/scr24x_v4.2.2/scr24x_2.6.x_v4.2.2/src/scr241_main.c:355: warn
ing: implicit declaration of function ‘pcmcia_release_io’
/home/laur/Desktop/scr24x_v4.2.2/scr24x_2.6.x_v4.2.2/src/scr241_main.c:365: erro
r: ‘DEVICE_EXTENSION’ has no member named ‘bSignalEvent’
/home/laur/Desktop/scr24x_v4.2.2/scr24x_2.6.x_v4.2.2/src/scr241_main.c:366: erro
r: ‘DEVICE_EXTENSION’ has no member named ‘bIsEventSet’
/home/laur/Desktop/scr24x_v4.2.2/scr24x_2.6.x_v4.2.2/src/scr241_main.c:367: erro
r: ‘DEVICE_EXTENSION’ has no member named ‘tqsReadEventWait’
/home/laur/Desktop/scr24x_v4.2.2/scr24x_2.6.x_v4.2.2/src/scr241_main.c:377: erro
r: ‘DEVICE_EXTENSION’ has no member named ‘bIsPolledMode’
/home/laur/Desktop/scr24x_v4.2.2/scr24x_2.6.x_v4.2.2/src/scr241_main.c:380: erro
r: ‘DEVICE_EXTENSION’ has no member named ‘bIsPolledMode’
/home/laur/Desktop/scr24x_v4.2.2/scr24x_2.6.x_v4.2.2/src/scr241_main.c:381: erro
r: ‘DEVICE_EXTENSION’ has no member named ‘bIsIrqSet’
/home/laur/Desktop/scr24x_v4.2.2/scr24x_2.6.x_v4.2.2/src/scr241_main.c:383: erro
r: ‘DEVICE_EXTENSION’ has no member named ‘pDE_thread’
/home/laur/Desktop/scr24x_v4.2.2/scr24x_2.6.x_v4.2.2/src/scr241_main.c:384: erro
r: ‘DEVICE_EXTENSION’ has no member named ‘pDE_thread’
/home/laur/Desktop/scr24x_v4.2.2/scr24x_2.6.x_v4.2.2/src/scr241_main.c:393: erro
r: ‘DEVICE_EXTENSION’ has no member named ‘pucDeviceName’
/home/laur/Desktop/scr24x_v4.2.2/scr24x_2.6.x_v4.2.2/src/scr241_main.c:395: erro
r: ‘DEVICE_EXTENSION’ has no member named ‘pucDeviceName’
/home/laur/Desktop/scr24x_v4.2.2/scr24x_2.6.x_v4.2.2/src/scr241_main.c:396: erro
r: ‘DEVICE_EXTENSION’ has no member named ‘pucDeviceName’
/home/laur/Desktop/scr24x_v4.2.2/scr24x_2.6.x_v4.2.2/src/scr241_main.c: In funct
ion ‘Driver_Suspend’:
/home/laur/Desktop/scr24x_v4.2.2/scr24x_2.6.x_v4.2.2/src/scr241_main.c:410: erro
r: ‘dev_link_t’ undeclared (first use in this function)
/home/laur/Desktop/scr24x_v4.2.2/scr24x_2.6.x_v4.2.2/src/scr241_main.c:410: erro
r: ‘pDeviceLink’ undeclared (first use in this function)
/home/laur/Desktop/scr24x_v4.2.2/scr24x_2.6.x_v4.2.2/src/scr241_main.c:411: warn
ing: ISO C90 forbids mixed declarations and code
/home/laur/Desktop/scr24x_v4.2.2/scr24x_2.6.x_v4.2.2/src/scr241_main.c:424: erro
r: ‘struct _DEVICE_EXTENSION’ has no member named ‘DeviceLink’
/home/laur/Desktop/scr24x_v4.2.2/scr24x_2.6.x_v4.2.2/src/scr241_main.c:438: erro
r: ‘DEV_SUSPEND’ undeclared (first use in this function)
/home/laur/Desktop/scr24x_v4.2.2/scr24x_2.6.x_v4.2.2/src/scr241_main.c:442: erro
r: ‘DEVICE_EXTENSION’ has no member named ‘nStop’
/home/laur/Desktop/scr24x_v4.2.2/scr24x_2.6.x_v4.2.2/src/scr241_main.c:443: erro
r: ‘DEV_CONFIG’ undeclared (first use in this function)
/home/laur/Desktop/scr24x_v4.2.2/scr24x_2.6.x_v4.2.2/src/scr241_main.c: In funct
ion ‘Driver_Resume’:
/home/laur/Desktop/scr24x_v4.2.2/scr24x_2.6.x_v4.2.2/src/scr241_main.c:455: erro
r: ‘dev_link_t’ undeclared (first use in this function)
/home/laur/Desktop/scr24x_v4.2.2/scr24x_2.6.x_v4.2.2/src/scr241_main.c:455: erro
r: ‘pDeviceLink’ undeclared (first use in this function)
/home/laur/Desktop/scr24x_v4.2.2/scr24x_2.6.x_v4.2.2/src/scr241_main.c:456: warn
ing: ISO C90 forbids mixed declarations and code
/home/laur/Desktop/scr24x_v4.2.2/scr24x_2.6.x_v4.2.2/src/scr241_main.c:469: erro
r: ‘struct _DEVICE_EXTENSION’ has no member named ‘DeviceLink’
/home/laur/Desktop/scr24x_v4.2.2/scr24x_2.6.x_v4.2.2/src/scr241_main.c:484: erro
r: ‘DEV_SUSPEND’ undeclared (first use in this function)
/home/laur/Desktop/scr24x_v4.2.2/scr24x_2.6.x_v4.2.2/src/scr241_main.c:490: erro
r: ‘DEVICE_EXTENSION’ has no member named ‘bIsIrqSet’
/home/laur/Desktop/scr24x_v4.2.2/scr24x_2.6.x_v4.2.2/src/scr241_main.c:490: erro
r: ‘DEVICE_EXTENSION’ has no member named ‘bIsPolledMode’
/home/laur/Desktop/scr24x_v4.2.2/scr24x_2.6.x_v4.2.2/src/scr241_main.c:493: erro
r: ‘DEVICE_EXTENSION’ has no member named ‘tqsCardStatusWait’
/home/laur/Desktop/scr24x_v4.2.2/scr24x_2.6.x_v4.2.2/src/scr241_main.c:494: erro
r: ‘DEVICE_EXTENSION’ has no member named ‘DE_thread_pid’
/home/laur/Desktop/scr24x_v4.2.2/scr24x_2.6.x_v4.2.2/src/scr241_main.c:498: erro
r: ‘DEV_CONFIG’ undeclared (first use in this function)
/home/laur/Desktop/scr24x_v4.2.2/scr24x_2.6.x_v4.2.2/src/scr241_main.c:508: erro
r: ‘DEVICE_EXTENSION’ has no member named ‘byPcdmRev’
/home/laur/Desktop/scr24x_v4.2.2/scr24x_2.6.x_v4.2.2/src/scr241_main.c:513: erro
r: ‘DEVICE_EXTENSION’ has no member named ‘byPcdmRev’
/home/laur/Desktop/scr24x_v4.2.2/scr24x_2.6.x_v4.2.2/src/scr241_main.c:518: erro
r: ‘DEVICE_EXTENSION’ has no member named ‘byPcdmRev’
/home/laur/Desktop/scr24x_v4.2.2/scr24x_2.6.x_v4.2.2/src/scr241_main.c:526: erro
r: ‘DEVICE_EXTENSION’ has no member named ‘byPcdmRev’
/home/laur/Desktop/scr24x_v4.2.2/scr24x_2.6.x_v4.2.2/src/scr241_main.c:535: erro
r: ‘DEVICE_EXTENSION’ has no member named ‘bIsSystemResume’
/home/laur/Desktop/scr24x_v4.2.2/scr24x_2.6.x_v4.2.2/src/scr241_main.c:539: erro
r: ‘DEVICE_EXTENSION’ has no member named ‘nStop’
/home/laur/Desktop/scr24x_v4.2.2/scr24x_2.6.x_v4.2.2/src/scr241_main.c: At top l
evel:
/home/laur/Desktop/scr24x_v4.2.2/scr24x_2.6.x_v4.2.2/src/scr241_main.c:972: erro
r: expected ‘)’ before ‘*’ token
/home/laur/Desktop/scr24x_v4.2.2/scr24x_2.6.x_v4.2.2/src/scr241_main.c: In funct
ion ‘Driver_SetIOBase’:
/home/laur/Desktop/scr24x_v4.2.2/scr24x_2.6.x_v4.2.2/src/scr241_main.c:1367: err
or: ‘DEVICE_EXTENSION’ has no member named ‘IoBase’
/home/laur/Desktop/scr24x_v4.2.2/scr24x_2.6.x_v4.2.2/src/scr241_main.c: In funct
ion ‘Driver_InitLocal’:
/home/laur/Desktop/scr24x_v4.2.2/scr24x_2.6.x_v4.2.2/src/scr241_main.c:1383: err
or: ‘DEVICE_EXTENSION’ has no member named ‘irqFlag’
/home/laur/Desktop/scr24x_v4.2.2/scr24x_2.6.x_v4.2.2/src/scr241_main.c:1384: err
or: ‘DEVICE_EXTENSION’ has no member named ‘inIOCTL’
/home/laur/Desktop/scr24x_v4.2.2/scr24x_2.6.x_v4.2.2/src/scr241_main.c:1385: err
or: ‘DEVICE_EXTENSION’ has no member named ‘prevCardStatus’
/home/laur/Desktop/scr24x_v4.2.2/scr24x_2.6.x_v4.2.2/src/scr241_main.c:1386: err
or: ‘DEVICE_EXTENSION’ has no member named ‘cardStsChange’
/home/laur/Desktop/scr24x_v4.2.2/scr24x_2.6.x_v4.2.2/src/scr241_main.c:1387: err
or: ‘DEVICE_EXTENSION’ has no member named ‘cmd_lock’
/home/laur/Desktop/scr24x_v4.2.2/scr24x_2.6.x_v4.2.2/src/scr241_main.c:1388: err
or: ‘DEVICE_EXTENSION’ has no member named ‘ioctl_lock’
/home/laur/Desktop/scr24x_v4.2.2/scr24x_2.6.x_v4.2.2/src/scr241_main.c:1389: err
or: ‘DEVICE_EXTENSION’ has no member named ‘rdwr_lock’
/home/laur/Desktop/scr24x_v4.2.2/scr24x_2.6.x_v4.2.2/src/scr241_main.c:1391: err
or: ‘DEVICE_EXTENSION’ has no member named ‘byPcdmRev’
/home/laur/Desktop/scr24x_v4.2.2/scr24x_2.6.x_v4.2.2/src/scr241_main.c:1393: err
or: ‘DEVICE_EXTENSION’ has no member named ‘cmd_lock’
/home/laur/Desktop/scr24x_v4.2.2/scr24x_2.6.x_v4.2.2/src/scr241_main.c:1394: err
or: ‘DEVICE_EXTENSION’ has no member named ‘ioctl_lock’
/home/laur/Desktop/scr24x_v4.2.2/scr24x_2.6.x_v4.2.2/src/scr241_main.c:1395: err
or: ‘DEVICE_EXTENSION’ has no member named ‘rdwr_lock’
/home/laur/Desktop/scr24x_v4.2.2/scr24x_2.6.x_v4.2.2/src/scr241_main.c:1397: err
or: ‘DEVICE_EXTENSION’ has no member named ‘wait’
/home/laur/Desktop/scr24x_v4.2.2/scr24x_2.6.x_v4.2.2/src/scr241_main.c:1398: err
or: ‘DEVICE_EXTENSION’ has no member named ‘delay’
/home/laur/Desktop/scr24x_v4.2.2/scr24x_2.6.x_v4.2.2/src/scr241_main.c:1403: err
or: ‘DEVICE_EXTENSION’ has no member named ‘bBootRomPresent’
/home/laur/Desktop/scr24x_v4.2.2/scr24x_2.6.x_v4.2.2/src/scr241_main.c: In funct
ion ‘CardStatusCheck’:
/home/laur/Desktop/scr24x_v4.2.2/scr24x_2.6.x_v4.2.2/src/scr241_main.c:1425: err
or: ‘DEVICE_EXTENSION’ has no member named ‘cmd_lock’
/home/laur/Desktop/scr24x_v4.2.2/scr24x_2.6.x_v4.2.2/src/scr241_main.c:1426: err
or: ‘DEVICE_EXTENSION’ has no member named ‘irqFlag’
/home/laur/Desktop/scr24x_v4.2.2/scr24x_2.6.x_v4.2.2/src/scr241_main.c:1430: err
or: ‘DEVICE_EXTENSION’ has no member named ‘cmd_lock’
/home/laur/Desktop/scr24x_v4.2.2/scr24x_2.6.x_v4.2.2/src/scr241_main.c: In funct
ion ‘IFDHClose’:
/home/laur/Desktop/scr24x_v4.2.2/scr24x_2.6.x_v4.2.2/src/scr241_main.c:1493: err
or: ‘DEVICE_EXTENSION’ has no member named ‘bIsPolledMode’
/home/laur/Desktop/scr24x_v4.2.2/scr24x_2.6.x_v4.2.2/src/scr241_main.c:1495: err
or: ‘DEVICE_EXTENSION’ has no member named ‘bOrgIrqStatus’
/home/laur/Desktop/scr24x_v4.2.2/scr24x_2.6.x_v4.2.2/src/scr241_main.c:1497: err
or: ‘DEVICE_EXTENSION’ has no member named ‘bIsPolledMode’
/home/laur/Desktop/scr24x_v4.2.2/scr24x_2.6.x_v4.2.2/src/scr241_main.c:1498: err
or: ‘DEVICE_EXTENSION’ has no member named ‘bIsIrqSet’
/home/laur/Desktop/scr24x_v4.2.2/scr24x_2.6.x_v4.2.2/src/scr241_main.c:1498: err
or: ‘DEVICE_EXTENSION’ has no member named ‘bOrgIrqStatus’
/home/laur/Desktop/scr24x_v4.2.2/scr24x_2.6.x_v4.2.2/src/scr241_main.c:1500: err
or: ‘DEVICE_EXTENSION’ has no member named ‘bOrgIrqStatus’
/home/laur/Desktop/scr24x_v4.2.2/scr24x_2.6.x_v4.2.2/src/scr241_main.c:1504: err
or: ‘DEVICE_EXTENSION’ has no member named ‘pDE_thread’
/home/laur/Desktop/scr24x_v4.2.2/scr24x_2.6.x_v4.2.2/src/scr241_main.c: In funct
ion ‘IFDHIoctl’:
/home/laur/Desktop/scr24x_v4.2.2/scr24x_2.6.x_v4.2.2/src/scr241_main.c:1552: err
or: ‘DEVICE_EXTENSION’ has no member named ‘nStop’
/home/laur/Desktop/scr24x_v4.2.2/scr24x_2.6.x_v4.2.2/src/scr241_main.c:1569: err
or: ‘DEVICE_EXTENSION’ has no member named ‘irqFlag’
/home/laur/Desktop/scr24x_v4.2.2/scr24x_2.6.x_v4.2.2/src/scr241_main.c:1571: err
or: ‘DEVICE_EXTENSION’ has no member named ‘irqFlag’
/home/laur/Desktop/scr24x_v4.2.2/scr24x_2.6.x_v4.2.2/src/scr241_main.c:1591: err
or: ‘DEVICE_EXTENSION’ has no member named ‘byCardStatus’
/home/laur/Desktop/scr24x_v4.2.2/scr24x_2.6.x_v4.2.2/src/scr241_main.c:1599: err
or: ‘DEVICE_EXTENSION’ has no member named ‘bBootRomPresent’
/home/laur/Desktop/scr24x_v4.2.2/scr24x_2.6.x_v4.2.2/src/scr241_main.c:1613: err
or: ‘DEVICE_EXTENSION’ has no member named ‘pucFwBuffer’
/home/laur/Desktop/scr24x_v4.2.2/scr24x_2.6.x_v4.2.2/src/scr241_main.c:1616: err
or: ‘DEVICE_EXTENSION’ has no member named ‘pucFwBuffer’
/home/laur/Desktop/scr24x_v4.2.2/scr24x_2.6.x_v4.2.2/src/scr241_main.c:1621: err
or: ‘DEVICE_EXTENSION’ has no member named ‘pucFwBuffer’
/home/laur/Desktop/scr24x_v4.2.2/scr24x_2.6.x_v4.2.2/src/scr241_main.c:1621: err
or: ‘DEVICE_EXTENSION’ has no member named ‘pucFwBuffer’
/home/laur/Desktop/scr24x_v4.2.2/scr24x_2.6.x_v4.2.2/src/scr241_main.c:1621: err
or: ‘DEVICE_EXTENSION’ has no member named ‘pucFwBuffer’
/home/laur/Desktop/scr24x_v4.2.2/scr24x_2.6.x_v4.2.2/src/scr241_main.c:1621: err
or: ‘DEVICE_EXTENSION’ has no member named ‘pucFwBuffer’
/home/laur/Desktop/scr24x_v4.2.2/scr24x_2.6.x_v4.2.2/src/scr241_main.c:1622: err
or: ‘DEVICE_EXTENSION’ has no member named ‘ulOffset’
/home/laur/Desktop/scr24x_v4.2.2/scr24x_2.6.x_v4.2.2/src/scr241_main.c:1629: err
or: ‘DEVICE_EXTENSION’ has no member named ‘ulOffset’
/home/laur/Desktop/scr24x_v4.2.2/scr24x_2.6.x_v4.2.2/src/scr241_main.c:1631: err
or: ‘DEVICE_EXTENSION’ has no member named ‘pucFwBuffer’
/home/laur/Desktop/scr24x_v4.2.2/scr24x_2.6.x_v4.2.2/src/scr241_main.c:1636: err
or: ‘DEVICE_EXTENSION’ has no member named ‘pucFwBuffer’
/home/laur/Desktop/scr24x_v4.2.2/scr24x_2.6.x_v4.2.2/src/scr241_main.c:1636: err
or: ‘DEVICE_EXTENSION’ has no member named ‘pucFwBuffer’
/home/laur/Desktop/scr24x_v4.2.2/scr24x_2.6.x_v4.2.2/src/scr241_main.c:1641: err
or: ‘DEVICE_EXTENSION’ has no member named ‘ulOffset’
/home/laur/Desktop/scr24x_v4.2.2/scr24x_2.6.x_v4.2.2/src/scr241_main.c:1647: err
or: ‘DEVICE_EXTENSION’ has no member named ‘pucFwBuffer’
/home/laur/Desktop/scr24x_v4.2.2/scr24x_2.6.x_v4.2.2/src/scr241_main.c:1664: err
or: ‘DEVICE_EXTENSION’ has no member named ‘bBootRomPresent’
/home/laur/Desktop/scr24x_v4.2.2/scr24x_2.6.x_v4.2.2/src/scr241_main.c:1673: err
or: ‘DEVICE_EXTENSION’ has no member named ‘bBootRomPresent’
/home/laur/Desktop/scr24x_v4.2.2/scr24x_2.6.x_v4.2.2/src/scr241_main.c:1706: err
or: ‘DEVICE_EXTENSION’ has no member named ‘bIsPolledMode’
/home/laur/Desktop/scr24x_v4.2.2/scr24x_2.6.x_v4.2.2/src/scr241_main.c:1708: err
or: ‘DEVICE_EXTENSION’ has no member named ‘bIsPolledMode’
/home/laur/Desktop/scr24x_v4.2.2/scr24x_2.6.x_v4.2.2/src/scr241_main.c:1709: err
or: ‘DEVICE_EXTENSION’ has no member named ‘tqsCardStatusWait’
/home/laur/Desktop/scr24x_v4.2.2/scr24x_2.6.x_v4.2.2/src/scr241_main.c:1710: err
or: ‘DEVICE_EXTENSION’ has no member named ‘DE_thread_pid’
/home/laur/Desktop/scr24x_v4.2.2/scr24x_2.6.x_v4.2.2/src/scr241_main.c:1716: err
or: ‘DEVICE_EXTENSION’ has no member named ‘bIsPolledMode’
/home/laur/Desktop/scr24x_v4.2.2/scr24x_2.6.x_v4.2.2/src/scr241_main.c:1719: err
or: ‘DEVICE_EXTENSION’ has no member named ‘bIsPolledMode’
/home/laur/Desktop/scr24x_v4.2.2/scr24x_2.6.x_v4.2.2/src/scr241_main.c:1720: err
or: ‘DEVICE_EXTENSION’ has no member named ‘bIsIrqSet’
/home/laur/Desktop/scr24x_v4.2.2/scr24x_2.6.x_v4.2.2/src/scr241_main.c:1720: err
or: ‘DEVICE_EXTENSION’ has no member named ‘bOrgIrqStatus’
/home/laur/Desktop/scr24x_v4.2.2/scr24x_2.6.x_v4.2.2/src/scr241_main.c:1721: err
or: ‘DEVICE_EXTENSION’ has no member named ‘pDE_thread’
/home/laur/Desktop/scr24x_v4.2.2/scr24x_2.6.x_v4.2.2/src/scr241_main.c:1722: err
or: ‘DEVICE_EXTENSION’ has no member named ‘pDE_thread’
/home/laur/Desktop/scr24x_v4.2.2/scr24x_2.6.x_v4.2.2/src/scr241_main.c:1728: err
or: ‘DEVICE_EXTENSION’ has no member named ‘bIsIrqSet’
/home/laur/Desktop/scr24x_v4.2.2/scr24x_2.6.x_v4.2.2/src/scr241_main.c:1734: err
or: ‘DEVICE_EXTENSION’ has no member named ‘byPcdmRev’
/home/laur/Desktop/scr24x_v4.2.2/scr24x_2.6.x_v4.2.2/src/scr241_main.c:1745: err
or: ‘DEVICE_EXTENSION’ has no member named ‘inIOCTL’
/home/laur/Desktop/scr24x_v4.2.2/scr24x_2.6.x_v4.2.2/src/scr241_main.c: In funct
ion ‘IFDHRead’:
/home/laur/Desktop/scr24x_v4.2.2/scr24x_2.6.x_v4.2.2/src/scr241_main.c:1797: err
or: ‘DEVICE_EXTENSION’ has no member named ‘nStop’
/home/laur/Desktop/scr24x_v4.2.2/scr24x_2.6.x_v4.2.2/src/scr241_main.c:1805: err
or: ‘DEVICE_EXTENSION’ has no member named ‘bIsSystemResume’
/home/laur/Desktop/scr24x_v4.2.2/scr24x_2.6.x_v4.2.2/src/scr241_main.c:1808: err
or: ‘DEVICE_EXTENSION’ has no member named ‘bIsSystemResume’
/home/laur/Desktop/scr24x_v4.2.2/scr24x_2.6.x_v4.2.2/src/scr241_main.c:1812: err
or: ‘DEVICE_EXTENSION’ has no member named ‘byCardStatus’
/home/laur/Desktop/scr24x_v4.2.2/scr24x_2.6.x_v4.2.2/src/scr241_main.c: In funct
ion ‘Driver_IrqHandler’:
/home/laur/Desktop/scr24x_v4.2.2/scr24x_2.6.x_v4.2.2/src/scr241_main.c:1958: err
or: ‘DEVICE_EXTENSION’ has no member named ‘nStop’
/home/laur/Desktop/scr24x_v4.2.2/scr24x_2.6.x_v4.2.2/src/scr241_main.c:1965: err
or: ‘DEVICE_EXTENSION’ has no member named ‘bIsPolledMode’
/home/laur/Desktop/scr24x_v4.2.2/scr24x_2.6.x_v4.2.2/src/scr241_main.c: In funct
ion ‘tqGetCardStatus’:
/home/laur/Desktop/scr24x_v4.2.2/scr24x_2.6.x_v4.2.2/src/scr241_main.c:1994: err
or: ‘struct _DEVICE_EXTENSION’ has no member named ‘nStop’
/home/laur/Desktop/scr24x_v4.2.2/scr24x_2.6.x_v4.2.2/src/scr241_main.c:1999: err
or: ‘struct _DEVICE_EXTENSION’ has no member named ‘bBootRomPresent’
/home/laur/Desktop/scr24x_v4.2.2/scr24x_2.6.x_v4.2.2/src/scr241_main.c:2004: err
or: ‘struct _DEVICE_EXTENSION’ has no member named ‘bIsQueueSet’
/home/laur/Desktop/scr24x_v4.2.2/scr24x_2.6.x_v4.2.2/src/scr241_main.c: In funct
ion ‘PcdmCardStatusThread’:
/home/laur/Desktop/scr24x_v4.2.2/scr24x_2.6.x_v4.2.2/src/scr241_main.c:2017: err
or: ‘struct _DEVICE_EXTENSION’ has no member named ‘IoBase’
/home/laur/Desktop/scr24x_v4.2.2/scr24x_2.6.x_v4.2.2/src/scr241_main.c:2021: err
or: ‘struct _DEVICE_EXTENSION’ has no member named ‘bBootRomPresent’
/home/laur/Desktop/scr24x_v4.2.2/scr24x_2.6.x_v4.2.2/src/scr241_main.c:2039: err
or: ‘struct _DEVICE_EXTENSION’ has no member named ‘tqsCardStatusWait’
/home/laur/Desktop/scr24x_v4.2.2/scr24x_2.6.x_v4.2.2/src/scr241_main.c:2054: err
or: ‘struct _DEVICE_EXTENSION’ has no member named ‘bBootRomPresent’
/home/laur/Desktop/scr24x_v4.2.2/scr24x_2.6.x_v4.2.2/src/scr241_main.c:2063: err
or: ‘struct _DEVICE_EXTENSION’ has no member named ‘bBootRomPresent’
make[2]: *** [/home/laur/Desktop/scr24x_v4.2.2/scr24x_2.6.x_v4.2.2/src/scr241_ma                               in.o] Error 1
make[1]: *** [_module_/home/laur/Desktop/scr24x_v4.2.2/scr24x_2.6.x_v4.2.2/src]                                Error 2
make[1]: Leaving directory `/usr/src/linux-2.6.17-5mdv'
make: *** [default] Error 2
mkdir -p /lib/modules/`uname -r`/pcmcia
cp -f SCR24x.ko /lib/modules/`uname -r`/pcmcia/
cp: stat `SCR24x.ko' ei õnnestu: No such file or directory
make: *** [install] Error 1
rm -f *.o
rm -f *.ko
rm -f *.mod.*
rm -f .*.cmd
rm -rf .tmp_*
rm -f *~
Copied Release bundle
                     :Done
current reader.conf backedup as reader.conf.bak
Found pcsclite version 1.3.1
reader.conf updated
Installation Complete.