All pastes #205312 Raw Edit

Someone

public text v1 · immutable
#205312 ·published 2006-10-16 18:43 UTC
rendered paste body
 gcc -DHAVE_CONFIG_H -I. -I. -I../.. -I../.. -I../../addressbook -I../../address book/backend -I../../addressbook/backend -I../../e-util -I../../e-util -I../../w idgets/misc -I../../widgets/misc -DORBIT2=1 -pthread -I/usr/include/libart-2.0 - I/usr/include/cairo -I/usr/include/freetype2 -I/usr/X11R6/include -I/usr/include /libpng12 -I/usr/include/libxml2 -I/opt/gnome/include -I/opt/gnome/include/libgn ome-2.0 -I/opt/gnome/include/libgnomeui-2.0 -I/opt/gnome/include/glib-2.0 -I/opt /gnome/lib/glib-2.0/include -I/opt/gnome/include/orbit-2.0 -I/opt/gnome/include/ libbonobo-2.0 -I/opt/gnome/include/gconf/2 -I/opt/gnome/include/gnome-vfs-2.0 -I /opt/gnome/lib/gnome-vfs-2.0/include -I/opt/gnome/include/bonobo-activation-2.0 -I/opt/gnome/include/libgnomecanvas-2.0 -I/opt/gnome/include/gtk-2.0 -I/opt/gnom e/include/libbonoboui-2.0 -I/opt/gnome/include/gnome-keyring-1 -I/opt/gnome/incl ude/pango-1.0 -I/opt/gnome/lib/gtk-2.0/include -I/opt/gnome/include/atk-1.0 -I/o pt/gnome/include/libglade-2.0 -I/opt/gnome/include/libgnomeprintui-2.2 -I/opt/gn ome/include/libgnomeprint-2.2 -I/opt/gnome/include/libgtkhtml-3.8 -I/opt/gnome/i nclude/evolution-data-server-1.8 -O2 -g -m32 -march=i586 -mtune=i686 -fmessage-l ength=0 -D_FORTIFY_SOURCE=2 -fstack-protector -fPIC -fno-strict-aliasing -DLDAP_ DEPRECATED -Wall -Wmissing-prototypes -Wno-sign-compare -MT address-conduit.lo - MD -MP -MF .deps/address-conduit.Tpo -c address-conduit.c  -fPIC -DPIC -o .libs/ address-conduit.o
address-conduit.c: In function 'local_record_from_ecard':
address-conduit.c:837: error: 'pi_buffer_t' undeclared (first use in this functi on)
address-conduit.c:837: error: (Each undeclared identifier is reported only once
address-conduit.c:837: error: for each function it appears in.)
address-conduit.c:837: error: 'buffer' undeclared (first use in this function)
address-conduit.c:837: warning: implicit declaration of function 'pi_buffer_new'
address-conduit.c:843: error: too few arguments to function 'dlp_ReadRecordById'
address-conduit.c:862: warning: implicit declaration of function 'pi_buffer_free '
address-conduit.c: In function 'addressbook_authenticate':
address-conduit.c:1178: warning: assignment discards qualifiers from pointer tar get type
address-conduit.c:1179: warning: assignment discards qualifiers from pointer tar get type
address-conduit.c:1183: warning: assignment discards qualifiers from pointer tar get type
address-conduit.c:1185: warning: assignment discards qualifiers from pointer tar get type
address-conduit.c: In function 'pre_sync':
address-conduit.c:1217: error: 'pi_buffer_t' undeclared (first use in this funct ion)
address-conduit.c:1217: error: 'buffer' undeclared (first use in this function)
address-conduit.c:1236: warning: assignment discards qualifiers from pointer tar get type
address-conduit.c:1309: warning: passing argument 4 of 'dlp_ReadAppBlock' makes pointer from integer without a cast
address-conduit.c: In function 'for_each':
address-conduit.c:1409: warning: ignoring return value of 'g_list_prepend', decl ared with attribute warn_unused_result
address-conduit.c:1424: warning: ignoring return value of 'g_list_prepend', decl ared with attribute warn_unused_result
address-conduit.c: In function 'for_each_modified':
address-conduit.c:1463: warning: ignoring return value of 'g_list_prepend', decl ared with attribute warn_unused_result
address-conduit.c:1477: warning: ignoring return value of 'g_list_prepend', decl ared with attribute warn_unused_result
make[5]: *** [address-conduit.lo] Ошибка 1
make[5]: Leaving directory `/usr/src/packages/BUILD/evolution-2.8.1/addressbook/ conduit'
make[4]: *** [all] Ошибка 2
make[4]: Leaving directory `/usr/src/packages/BUILD/evolution-2.8.1/addressbook/ conduit'
make[3]: *** [all-recursive] Ошибка 1
make[3]: Leaving directory `/usr/src/packages/BUILD/evolution-2.8.1/addressbook'
make[2]: *** [all] Ошибка 2
make[2]: Leaving directory `/usr/src/packages/BUILD/evolution-2.8.1/addressbook'
make[1]: *** [all-recursive] Ошибка 1
make[1]: Leaving directory `/usr/src/packages/BUILD/evolution-2.8.1'
make: *** [all] Ошибка 2