[sadow@R2D2 acpi4asus-0.30]$ make
make -C driver
make[1]: Entering directory `/home/sadow/acpi4asus-0.30/driver'
gcc -DLINUX -D__KERNEL__ -DMODULE -I/lib/modules/2.6.18-ARCH/build/include `./get_include.sh /lib/modules/2.6.18-ARCH/build/drivers/acpi /lib/modules/2.6.18-ARCH/build/include/acpi` -Wall -Wstrict-prototypes -fno-strict-aliasing -pipe -mpreferred-stack-boundary=2 -fomit-frame-pointer -c -o asus_core.o asus_core.c
In file included from /lib/modules/2.6.18-ARCH/build/include/asm/thread_info.h:16,
from /lib/modules/2.6.18-ARCH/build/include/linux/thread_info.h:21,
from /lib/modules/2.6.18-ARCH/build/include/linux/preempt.h:9,
from /lib/modules/2.6.18-ARCH/build/include/linux/spinlock.h:49,
from /lib/modules/2.6.18-ARCH/build/include/linux/capability.h:45,
from /lib/modules/2.6.18-ARCH/build/include/linux/sched.h:44,
from /lib/modules/2.6.18-ARCH/build/include/linux/module.h:9,
from asus_core.c:34:
/lib/modules/2.6.18-ARCH/build/include/asm/processor.h:80: error: 'CONFIG_X86_L1_CACHE_SHIFT' undeclared here (not in a function)
/lib/modules/2.6.18-ARCH/build/include/asm/processor.h:80: error: requested alignment is not a constant
In file included from /lib/modules/2.6.18-ARCH/build/include/linux/rwsem.h:24,
from /lib/modules/2.6.18-ARCH/build/include/asm/semaphore.h:42,
from /lib/modules/2.6.18-ARCH/build/include/linux/sched.h:57,
from /lib/modules/2.6.18-ARCH/build/include/linux/module.h:9,
from asus_core.c:34:
/lib/modules/2.6.18-ARCH/build/include/asm/rwsem.h: In function '__down_read':
/lib/modules/2.6.18-ARCH/build/include/asm/rwsem.h:104: error: expected ':' or ')' before 'KBUILD_BASENAME'
/lib/modules/2.6.18-ARCH/build/include/asm/rwsem.h: In function '__down_write_nested':
/lib/modules/2.6.18-ARCH/build/include/asm/rwsem.h:156: error: expected ':' or ')' before 'KBUILD_BASENAME'
/lib/modules/2.6.18-ARCH/build/include/asm/rwsem.h: In function '__up_read':
/lib/modules/2.6.18-ARCH/build/include/asm/rwsem.h:198: error: expected ':' or ')' before 'KBUILD_BASENAME'
/lib/modules/2.6.18-ARCH/build/include/asm/rwsem.h:192: warning: unused variable 'tmp'
/lib/modules/2.6.18-ARCH/build/include/asm/rwsem.h: In function '__up_write':
/lib/modules/2.6.18-ARCH/build/include/asm/rwsem.h:224: error: expected ':' or ')' before 'KBUILD_BASENAME'
/lib/modules/2.6.18-ARCH/build/include/asm/rwsem.h: In function '__downgrade_write':
/lib/modules/2.6.18-ARCH/build/include/asm/rwsem.h:249: error: expected ':' or ')' before 'KBUILD_BASENAME'
In file included from /lib/modules/2.6.18-ARCH/build/include/linux/sched.h:57,
from /lib/modules/2.6.18-ARCH/build/include/linux/module.h:9,
from asus_core.c:34:
/lib/modules/2.6.18-ARCH/build/include/asm/semaphore.h: In function 'down':
/lib/modules/2.6.18-ARCH/build/include/asm/semaphore.h:105: error: expected ':' or ')' before 'KBUILD_BASENAME'
/lib/modules/2.6.18-ARCH/build/include/asm/semaphore.h: In function 'down_interruptible':
/lib/modules/2.6.18-ARCH/build/include/asm/semaphore.h:130: error: expected ':' or ')' before 'KBUILD_BASENAME'
/lib/modules/2.6.18-ARCH/build/include/asm/semaphore.h: In function 'down_trylock':
/lib/modules/2.6.18-ARCH/build/include/asm/semaphore.h:155: error: expected ':' or ')' before 'KBUILD_BASENAME'
/lib/modules/2.6.18-ARCH/build/include/asm/semaphore.h: In function 'up':
/lib/modules/2.6.18-ARCH/build/include/asm/semaphore.h:179: error: expected ':' or ')' before 'KBUILD_BASENAME'
In file included from /lib/modules/2.6.18-ARCH/build/include/asm/smp.h:17,
from /lib/modules/2.6.18-ARCH/build/include/linux/smp.h:18,
from /lib/modules/2.6.18-ARCH/build/include/linux/sched.h:63,
from /lib/modules/2.6.18-ARCH/build/include/linux/module.h:9,
from asus_core.c:34:
/lib/modules/2.6.18-ARCH/build/include/asm/mpspec.h:6:25: error: mach_mpspec.h: No such file or directory
In file included from /lib/modules/2.6.18-ARCH/build/include/asm/smp.h:17,
from /lib/modules/2.6.18-ARCH/build/include/linux/smp.h:18,
from /lib/modules/2.6.18-ARCH/build/include/linux/sched.h:63,
from /lib/modules/2.6.18-ARCH/build/include/linux/module.h:9,
from asus_core.c:34:
/lib/modules/2.6.18-ARCH/build/include/asm/mpspec.h: At top level:
/lib/modules/2.6.18-ARCH/build/include/asm/mpspec.h:8: error: 'MAX_MP_BUSSES' undeclared here (not in a function)
/lib/modules/2.6.18-ARCH/build/include/asm/mpspec.h:22: error: 'MAX_IRQ_SOURCES' undeclared here (not in a function)
In file included from /lib/modules/2.6.18-ARCH/build/include/linux/smp.h:18,
from /lib/modules/2.6.18-ARCH/build/include/linux/sched.h:63,
from /lib/modules/2.6.18-ARCH/build/include/linux/module.h:9,
from asus_core.c:34:
/lib/modules/2.6.18-ARCH/build/include/asm/smp.h:76:26: error: mach_apicdef.h: No such file or directory
In file included from /lib/modules/2.6.18-ARCH/build/include/linux/smp.h:18,
from /lib/modules/2.6.18-ARCH/build/include/linux/sched.h:63,
from /lib/modules/2.6.18-ARCH/build/include/linux/module.h:9,
from asus_core.c:34:
/lib/modules/2.6.18-ARCH/build/include/asm/smp.h: In function 'hard_smp_processor_id':
/lib/modules/2.6.18-ARCH/build/include/asm/smp.h:80: warning: implicit declaration of function 'GET_APIC_ID'
In file included from /lib/modules/2.6.18-ARCH/build/include/linux/module.h:9,
from asus_core.c:34:
/lib/modules/2.6.18-ARCH/build/include/linux/sched.h: In function 'dequeue_signal_lock':
/lib/modules/2.6.18-ARCH/build/include/linux/sched.h:1209: warning: implicit declaration of function 'local_irq_save'
/lib/modules/2.6.18-ARCH/build/include/linux/sched.h:1211: warning: implicit declaration of function 'local_irq_restore'
/lib/modules/2.6.18-ARCH/build/include/linux/sched.h: In function 'lock_need_resched':
/lib/modules/2.6.18-ARCH/build/include/linux/sched.h:1470: error: 'spinlock_t' has no member named 'break_lock'
In file included from /lib/modules/2.6.18-ARCH/build/include/acpi/platform/acenv.h:140,
from /lib/modules/2.6.18-ARCH/build/include/acpi/acpi.h:54,
from /lib/modules/2.6.18-ARCH/build/include/linux/acpi.h:37,
from /lib/modules/2.6.18-ARCH/build/include/acpi/acpi_drivers.h:29,
from asus_core.c:38:
/lib/modules/2.6.18-ARCH/build/include/acpi/platform/aclinux.h: In function 'acpi_os_allocate':
/lib/modules/2.6.18-ARCH/build/include/acpi/platform/aclinux.h:116: warning: implicit declaration of function 'irqs_disabled'
asus_core.c: In function 'asus_hotk_get_info':
asus_core.c:1141: error: 'ACPI_TABLE_DSDT' undeclared (first use in this function)
asus_core.c:1141: error: (Each undeclared identifier is reported only once
asus_core.c:1141: error: for each function it appears in.)
asus_core.c:1172: warning: pointer targets in assignment differ in signedness
asus_core.c:1175: warning: implicit declaration of function 'acpi_os_free'
make[1]: *** [asus_core.o] Error 1
make[1]: Leaving directory `/home/sadow/acpi4asus-0.30/driver'
make: *** [build] Error 2
[sadow@R2D2 acpi4asus-0.30]$