Checked out revision 2726.
*info* running aclocal (-I m4)
/usr/share/aclocal/tcl.m4:20: warning: underquoted definition of SC_PATH_TCLCONFIG
run info '(automake)Extending aclocal'
or see http://sources.redhat.com/automake/automake.html#Extending-aclocal
/usr/share/aclocal/tcl.m4:124: warning: underquoted definition of SC_PATH_TKCONFIG
/usr/share/aclocal/tcl.m4:228: warning: underquoted definition of SC_LOAD_TCLCONFIG
/usr/share/aclocal/tcl.m4:295: warning: underquoted definition of SC_LOAD_TKCONFIG
/usr/share/aclocal/tcl.m4:332: warning: underquoted definition of SC_PROG_TCLSH
/usr/share/aclocal/tcl.m4:378: warning: underquoted definition of SC_BUILD_TCLSH
/usr/share/aclocal/tcl.m4:406: warning: underquoted definition of SC_ENABLE_SHARED
/usr/share/aclocal/tcl.m4:446: warning: underquoted definition of SC_ENABLE_FRAMEWORK
/usr/share/aclocal/tcl.m4:501: warning: underquoted definition of SC_ENABLE_THREADS
/usr/share/aclocal/tcl.m4:600: warning: underquoted definition of SC_ENABLE_SYMBOLS
/usr/share/aclocal/tcl.m4:657: warning: underquoted definition of SC_ENABLE_LANGINFO
/usr/share/aclocal/tcl.m4:708: warning: underquoted definition of SC_CONFIG_MANPAGES
/usr/share/aclocal/tcl.m4:840: warning: underquoted definition of SC_CONFIG_CFLAGS
/usr/share/aclocal/tcl.m4:2035: warning: underquoted definition of SC_SERIAL_PORT
/usr/share/aclocal/tcl.m4:2164: warning: underquoted definition of SC_MISSING_POSIX_HEADERS
/usr/share/aclocal/tcl.m4:2244: warning: underquoted definition of SC_PATH_X
/usr/share/aclocal/tcl.m4:2330: warning: underquoted definition of SC_BLOCKING_STYLE
/usr/share/aclocal/tcl.m4:2395: warning: underquoted definition of SC_TIME_HANDLER
/usr/share/aclocal/tcl.m4:2472: warning: underquoted definition of SC_BUGGY_STRTOD
/usr/share/aclocal/tcl.m4:2534: warning: underquoted definition of SC_TCL_LINK_LIBS
/usr/share/aclocal/tcl.m4:2611: warning: underquoted definition of SC_TCL_EARLY_FLAG
/usr/share/aclocal/tcl.m4:2623: warning: underquoted definition of SC_TCL_EARLY_FLAGS
/usr/share/aclocal/tcl.m4:2657: warning: underquoted definition of SC_TCL_64BIT_FLAGS
/usr/share/aclocal/smpeg.m4:13: warning: underquoted definition of AM_PATH_SMPEG
/usr/share/aclocal/lirc.m4:15: warning: underquoted definition of AC_PATH_LIRC
/usr/share/aclocal/libxosd.m4:9: warning: underquoted definition of AM_PATH_LIBXOSD
/usr/share/aclocal/libast.m4:11: warning: underquoted definition of AST_CHECK_LIBAST
/usr/share/aclocal/libast.m4:72: warning: underquoted definition of AST_SIZE_TYPE
/usr/share/aclocal/libast.m4:89: warning: underquoted definition of AST_REGEXP_SUPPORT
/usr/share/aclocal/libast.m4:153: warning: underquoted definition of AST_X11_SUPPORT
/usr/share/aclocal/libast.m4:183: warning: underquoted definition of AST_IMLIB2_SUPPORT
/usr/share/aclocal/libast.m4:218: warning: underquoted definition of AST_MMX_SUPPORT
/usr/share/aclocal/libast.m4:242: warning: underquoted definition of AST_STD_CHECKS
/usr/share/aclocal/libast.m4:278: warning: underquoted definition of AST_PROG_CHECKS
/usr/share/aclocal/libast.m4:290: warning: underquoted definition of AST_VAR_CHECKS
/usr/share/aclocal/libast.m4:310: warning: underquoted definition of AST_HEADER_CHECKS
/usr/share/aclocal/libast.m4:317: warning: underquoted definition of AST_FUNC_CHECKS
/usr/share/aclocal/libast.m4:328: warning: underquoted definition of AST_TYPE_CHECKS
/usr/share/aclocal/libast.m4:339: warning: underquoted definition of AST_ARG_DEBUG
/usr/share/aclocal/libast.m4:360: warning: underquoted definition of AST_ARG_REGEXP
/usr/share/aclocal/libast.m4:368: warning: underquoted definition of AST_ARG_BACKQUOTE_EXEC
/usr/share/aclocal/libast.m4:391: warning: underquoted definition of AST_FLAGS
/usr/share/aclocal/libast.m4:403: warning: underquoted definition of AST_STATUS
/usr/share/aclocal/libast.m4:429: warning: underquoted definition of dps_snprintf_oflow
/usr/share/aclocal/libast.m4:466: warning: underquoted definition of dps_vsnprintf_oflow
/usr/share/aclocal/libast.m4:512: warning: underquoted definition of dps_symlink_open_bug
/usr/share/aclocal/libast.m4:586: warning: underquoted definition of dps_rlimit_nproc
/usr/share/aclocal/libast.m4:634: warning: underquoted definition of dps_rlimit_memlock
/usr/share/aclocal/gpgme.m4:9: warning: underquoted definition of AM_PATH_GPGME
/usr/share/aclocal/glib.m4:8: warning: underquoted definition of AM_PATH_GLIB
*info* running autoheader
*info* running autoconf
checking build system type... i686-pc-linux-gnu
checking host system type... i686-pc-linux-gnu
checking target system type... i686-pc-linux-gnu
checking for a BSD-compatible install... /usr/bin/install -c
checking whether build environment is sane... yes
checking for gawk... gawk
checking whether make sets $(MAKE)... yes
checking whether NLS is requested... yes
checking for msgfmt... /usr/bin/msgfmt
checking for gmsgfmt... /usr/bin/msgfmt
checking for xgettext... /usr/bin/xgettext
checking for msgmerge... /usr/bin/msgmerge
checking for style of include used by make... GNU
checking for gcc... gcc
checking for C compiler default output file name... a.out
checking whether the C compiler works... yes
checking whether we are cross compiling... no
checking for suffix of executables...
checking for suffix of object files... o
checking whether we are using the GNU C compiler... yes
checking whether gcc accepts -g... yes
checking for gcc option to accept ANSI C... none needed
checking dependency style of gcc... none
checking for ranlib... ranlib
checking for library containing strerror... none required
checking how to run the C preprocessor... gcc -E
checking for egrep... grep -E
checking for ANSI C header files... yes
checking for an ANSI C-conforming const... yes
checking for inline... inline
checking for sys/types.h... yes
checking for sys/stat.h... yes
checking for stdlib.h... yes
checking for string.h... yes
checking for memory.h... yes
checking for strings.h... yes
checking for inttypes.h... yes
checking for stdint.h... yes
checking for unistd.h... yes
checking for off_t... yes
checking for size_t... yes
checking for working alloca.h... grep: conftest.er1: No such file or directory
yes
checking for alloca... yes
checking for stdlib.h... (cached) yes
checking for unistd.h... (cached) yes
checking for getpagesize... yes
checking for working mmap... yes
checking whether we are using the GNU C Library 2.1 or newer... yes
checking whether integer division by zero raises SIGFPE... yes
checking for inttypes.h... yes
checking for stdint.h... yes
checking for unsigned long long... yes
checking for inttypes.h... yes
checking whether the inttypes.h PRIxNN macros are broken... no
checking for ld used by GCC... /usr/bin/ld
checking if the linker (/usr/bin/ld) is GNU ld... yes
checking for shared library run path origin... done
checking argz.h usability... yes
checking argz.h presence... yes
checking for argz.h... yes
checking limits.h usability... yes
checking limits.h presence... yes
checking for limits.h... yes
checking locale.h usability... yes
checking locale.h presence... yes
checking for locale.h... yes
checking nl_types.h usability... yes
checking nl_types.h presence... yes
checking for nl_types.h... yes
checking malloc.h usability... yes
checking malloc.h presence... yes
checking for malloc.h... yes
checking stddef.h usability... grep: conftest.er1: No such file or directory
yes
checking stddef.h presence... cat: confdefs.h: No such file or directory
yes
checking for stddef.h... yes
checking for stdlib.h... (cached) yes
checking for string.h... (cached) yes
checking for unistd.h... (cached) yes
checking sys/param.h usability... grep: conftest.er1: No such file or directory
yes
checking sys/param.h presence... yes
checking for sys/param.h... yes
checking for feof_unlocked... yes
checking for fgets_unlocked... yes
checking for getc_unlocked... yes
checking for getcwd... yes
checking for getegid... yes
checking for geteuid... yes
checking for getgid... yes
checking for getuid... yes
checking for mempcpy... yes
checking for munmap... yes
checking for putenv... yes
checking for setenv... yes
checking for setlocale... yes
checking for stpcpy... yes
checking for strcasecmp... yes
checking for strdup... no
checking for strtoul... yes
checking for tsearch... sed: can't read conftest.c: No such file or directory
no
checking for __argz_count... cat: confdefs.h: No such file or directory
yes
checking for __argz_stringify... grep: conftest.er1: No such file or directory
yes
checking for __argz_next... yes
checking for __fsetlocking... yes
checking for iconv... yes
checking for iconv declaration...
extern size_t iconv (iconv_t cd, char * *inbuf, size_t *inbytesleft, char * *outbuf, size_t *outbytesleft);
checking for nl_langinfo and CODESET... yes
checking for LC_MESSAGES... yes
checking for bison... bison
checking version of bison... 2.1, ok
checking whether NLS is requested... yes
checking whether included gettext is requested... no
checking for GNU gettext in libc... yes
checking whether to use NLS... yes
checking where the gettext function comes from... libc
checking for gcc... (cached) gcc
checking whether we are using the GNU C compiler... (cached) yes
checking whether gcc accepts -g... (cached) yes
checking for gcc option to accept ANSI C... (cached) none needed
checking dependency style of gcc... (cached) none
checking for g++... g++
checking whether we are using the GNU C++ compiler... yes
checking whether g++ accepts -g... yes
checking dependency style of g++... none
checking for library containing strerror... (cached) none required
checking whether byte ordering is bigendian... no
checking for a BSD-compatible install... /usr/bin/install -c
checking whether ln -s works... yes
checking whether make sets $(MAKE)... (cached) yes
checking for rm... /bin/rm
checking for mv... /bin/mv
checking for cp... /bin/cp
checking for ar... /usr/bin/ar
checking for ranlib... /usr/bin/ranlib
checking for audacious... /usr/local/bin/audacious
checking for pkg-config... /usr/bin/pkg-config
checking for glib-2.0 >= 2.6.0 gtk+-2.0 >= 2.6.0 gthread-2.0 pango... yes
checking GTK_CFLAGS... -pthread -I/usr/include/glib-2.0 -I/usr/lib/glib-2.0/include -I/usr/include/gtk-2.0 -I/usr/lib/gtk-2.0/include -I/usr/include/atk-1.0 -I/usr/include/cairo -I/usr/include/pango-1.0
checking GTK_LIBS... -pthread -lgtk-x11-2.0 -lgdk-x11-2.0 -latk-1.0 -lgdk_pixbuf-2.0 -lm -lpangocairo-1.0 -lfontconfig -lXext -lXrender -lXinerama -lXi -lXrandr -lXcursor -lXfixes -lcairo -lX11 -lgthread-2.0 -lpango-1.0 -lgobject-2.0 -lgmodule-2.0 -ldl -lglib-2.0
checking for libglade-2.0 >= 2.3.1... yes
checking LIBGLADE_CFLAGS... -I/usr/local/include/libglade-2.0 -I/usr/include/gtk-2.0 -I/usr/include/libxml2 -I/usr/lib/gtk-2.0/include -I/usr/include/atk-1.0 -I/usr/include/cairo -I/usr/include/pango-1.0 -I/usr/include/glib-2.0 -I/usr/lib/glib-2.0/include
checking LIBGLADE_LIBS... -L/usr/local/lib -lglade-2.0 -lgtk-x11-2.0 -lxml2 -lz -lgdk-x11-2.0 -latk-1.0 -lgdk_pixbuf-2.0 -lm -lpangocairo-1.0 -lfontconfig -lXext -lXrender -lXinerama -lXi -lXrandr -lXcursor -lXfixes -lpango-1.0 -lcairo -lX11 -lgobject-2.0 -lgmodule-2.0 -ldl -lglib-2.0
checking for socklen_t... yes
checking for what extension and flags to use for plugin compilation... libdl-compatible: -fPIC -DPIC -shared, .so
checking if you are running Apple-GCC... no
checking for gconf-2.0 >= 2.6.0... yes
checking GCONF_CFLAGS... -DORBIT2=1 -pthread -I/usr/include/gconf/2 -I/usr/include/orbit-2.0 -I/usr/include/glib-2.0 -I/usr/lib/glib-2.0/include
checking GCONF_LIBS... -pthread -lgconf-2 -lORBit-2 -lm -lgmodule-2.0 -ldl -lgthread-2.0 -lglib-2.0
checking for gnome-vfs-2.0 >= 2.6.0... yes
checking GNOMEVFS_CFLAGS... -pthread -DORBIT2=1 -I/usr/include/gnome-vfs-2.0 -I/usr/lib/gnome-vfs-2.0/include -I/usr/include/bonobo-activation-2.0 -I/usr/include/libbonobo-2.0 -I/usr/include/gconf/2 -I/usr/include/glib-2.0 -I/usr/lib/glib-2.0/include -I/usr/include/orbit-2.0
checking GNOMEVFS_LIBS... -pthread -lgnomevfs-2 -lbonobo-2 -lgconf-2 -lgobject-2.0 -lbonobo-activation -lORBit-2 -lm -lgmodule-2.0 -ldl -lgthread-2.0 -lglib-2.0
checking linux/cdrom.h usability... yes
checking linux/cdrom.h presence... yes
checking for linux/cdrom.h... yes
checking sys/cdio.h usability... grep: conftest.er1: No such file or directory
sed: can't read conftest.c: No such file or directory
no
checking sys/cdio.h presence... yes
configure: WARNING: sys/cdio.h: present but cannot be compiled
configure: WARNING: sys/cdio.h: check for missing prerequisite headers?
configure: WARNING: sys/cdio.h: see the Autoconf documentation
configure: WARNING: sys/cdio.h: section "Present But Cannot Be Compiled"
configure: WARNING: sys/cdio.h: proceeding with the preprocessor's result
configure: WARNING: sys/cdio.h: in the future, the compiler will take precedence
configure: WARNING: ## ---------------------------------------- ##
configure: WARNING: ## Report this to bugs+audacious@atheme.org ##
configure: WARNING: ## ---------------------------------------- ##
checking for sys/cdio.h... yes
checking sys/cdrio.h usability... no
checking sys/cdrio.h presence... grep: conftest.er1: No such file or directory
no
checking for sys/cdrio.h... no
checking linux/joystick.h usability... yes
checking linux/joystick.h presence... yes
checking for linux/joystick.h... yes
checking for unistd.h... (cached) yes
checking fcntl.h usability... sed: can't read conftest.c: No such file or directory
no
checking fcntl.h presence... yes
configure: WARNING: fcntl.h: present but cannot be compiled
configure: WARNING: fcntl.h: check for missing prerequisite headers?
configure: WARNING: fcntl.h: see the Autoconf documentation
configure: WARNING: fcntl.h: section "Present But Cannot Be Compiled"
configure: WARNING: fcntl.h: proceeding with the preprocessor's result
configure: WARNING: fcntl.h: in the future, the compiler will take precedence
configure: WARNING: ## ---------------------------------------- ##
configure: WARNING: ## Report this to bugs+audacious@atheme.org ##
configure: WARNING: ## ---------------------------------------- ##
checking for fcntl.h... yes
checking sys/ioctl.h usability... yes
checking sys/ioctl.h presence... yes
checking for sys/ioctl.h... yes
checking fnmatch.h usability... yes
checking fnmatch.h presence... yes
checking for fnmatch.h... yes
checking for limits.h... (cached) yes
checking wchar.h usability... grep: conftest.er1: No such file or directory
no
checking wchar.h presence... yes
configure: WARNING: wchar.h: present but cannot be compiled
configure: WARNING: wchar.h: check for missing prerequisite headers?
configure: WARNING: wchar.h: see the Autoconf documentation
configure: WARNING: wchar.h: section "Present But Cannot Be Compiled"
configure: WARNING: wchar.h: proceeding with the preprocessor's result
configure: WARNING: wchar.h: in the future, the compiler will take precedence
configure: WARNING: ## ---------------------------------------- ##
configure: WARNING: ## Report this to bugs+audacious@atheme.org ##
configure: WARNING: ## ---------------------------------------- ##
checking for wchar.h... yes
checking fts.h usability... grep: conftest.er1: No such file or directory
no
checking fts.h presence... yes
configure: WARNING: fts.h: present but cannot be compiled
configure: WARNING: fts.h: check for missing prerequisite headers?
configure: WARNING: fts.h: see the Autoconf documentation
configure: WARNING: fts.h: section "Present But Cannot Be Compiled"
configure: WARNING: fts.h: proceeding with the preprocessor's result
configure: WARNING: fts.h: in the future, the compiler will take precedence
configure: WARNING: ## ---------------------------------------- ##
configure: WARNING: ## Report this to bugs+audacious@atheme.org ##
configure: WARNING: ## ---------------------------------------- ##
checking for fts.h... yes
checking for mkdtemp... grep: conftest.er1: No such file or directory
yes
checking for getmntinfo... grep: conftest.er1: No such file or directory
no
checking for statvfs... no
checking for strtoul... (cached) yes
checking for lrintf... no
checking if __ELF__ is defined... yes
checking for xml2-config... /usr/bin/xml2-config
checking for libxml - version >= 2.0.0... no
*** Could not run libxml test program, checking why...
*** The test program failed to compile or link. See the file config.log for the
*** exact error that occured. This usually means LIBXML was incorrectly installed
*** or that you have moved LIBXML since it was installed. In the latter case, you
*** may want to edit the xml2-config script: /usr/bin/xml2-config
configure: WARNING: *** libxml2 is not installed. Paranormal nor XSPF support will not be built. ***
configure: creating ./config.status
config.status: creating audtool.1
config.status: creating audacious.1
config.status: creating audacious.spec
config.status: creating audacious.pc
config.status: creating audacious/audacious.desktop
config.status: creating po/Makefile.in
config.status: creating mk/rules.mk
config.status: creating config.h
config.status: executing default-1 commands
config.status: creating po/POTFILES
config.status: creating po/Makefile
config.status: executing depfiles commands
Configuration:
Install path: /usr/local
Current Audacious executable: /usr/local/bin/audacious
Configuration path: $HOME/.audacious
Use one plugin dir: no
Allow user plugin dir: yes
GNOME support
-------------
GConf support yes
VFS support yes
CC configdb_gconf.c
CC rcfile.c
CC vfs_gnome.c
CC vfs_common.c
CC beepctrl.c
In file included from /usr/include/glib-2.0/glib/gmacros.h:36,
from /usr/lib/glib-2.0/include/glibconfig.h:9,
from /usr/include/glib-2.0/glib/gtypes.h:30,
from /usr/include/glib-2.0/glib/galloca.h:30,
from /usr/include/glib-2.0/glib.h:30,
from beepctrl.c:25:
/usr/lib/gcc/i486-linux-gnu/4.0.3/include/stddef.h:214: error: duplicate ‘unsigned’
In file included from /usr/include/netinet/in.h:23,
from /usr/include/arpa/inet.h:23,
from beepctrl.c:30:
/usr/include/stdint.h:141: error: duplicate ‘unsigned’
/usr/include/stdint.h:141: error: ‘long long long’ is too long for GCC
make[2]: *** [beepctrl.o] Error 1
make[1]: *** [build] Error 2
make: *** [build] Error 2