rendered paste body------ Build started: Project: shockwaveDeath, Configuration: Debug Win32 ------
Linking...
shockwaveDeath.def(2) : warning LNK4017: DESCRIPTION statement not supported for the target platform; ignored
Creating library Debug/shockwaveDeath.lib and object Debug/shockwaveDeath.exp
shockwaveDeath.obj : error LNK2019: unresolved external symbol __imp_?bz_registerEvent@@YA_NW4bz_eEventType@@PAVbz_EventHandler@@@Z referenced in function "int __cdecl bz_Load(char const *)" (?bz_Load@@YAHPBD@Z)
shockwaveDeath.obj : error LNK2019: unresolved external symbol __imp_?bz_removeEvent@@YA_NW4bz_eEventType@@PAVbz_EventHandler@@@Z referenced in function "int __cdecl bz_Unload(void)" (?bz_Unload@@YAHXZ)
Debug/shockwaveDeath.dll : fatal error LNK1120: 2 unresolved externals
Build log was saved at "file://c:\CVSLATEST\bzflag\plugins\shockwaveDeath\Debug\BuildLog.htm"
shockwaveDeath - 3 error(s), 1 warning(s)
========== Build: 0 succeeded, 1 failed, 0 up-to-date, 0 skipped ==========