rendered paste bodystephen@ubuntu:~/devel/sources/amarok-1.4.3$ make install
Makefile:1042: warning: overriding commands for target `clean-bcheck'
Makefile:1005: warning: ignoring old commands for target `clean-bcheck'
Makefile:1047: warning: overriding commands for target `bcheck-am'
Makefile:1010: warning: ignoring old commands for target `bcheck-am'
Making install in amarok
make[1]: Entering directory `/home/stephen/devel/sources/amarok-1.4.3/amarok'
Making install in src
make[2]: Entering directory `/home/stephen/devel/sources/amarok-1.4.3/amarok/src'
Making install in amarokcore
make[3]: Entering directory `/home/stephen/devel/sources/amarok-1.4.3/amarok/src/amarokcore'
make[4]: Entering directory `/home/stephen/devel/sources/amarok-1.4.3/amarok/src/amarokcore'
make[4]: Nothing to be done for `install-exec-am'.
test -z "/usr/share/config.kcfg" || mkdir -p -- "/usr/share/config.kcfg"
/usr/bin/install -c -p -m 644 'amarok.kcfg' '/usr/share/config.kcfg/amarok.kcfg'
/usr/bin/install: cannot create regular file `/usr/share/config.kcfg/amarok.kcfg': Permission denied
make[4]: *** [install-kde_kcfgDATA] Error 1
make[4]: Leaving directory `/home/stephen/devel/sources/amarok-1.4.3/amarok/src/amarokcore'
make[3]: *** [install-am] Error 2
make[3]: Leaving directory `/home/stephen/devel/sources/amarok-1.4.3/amarok/src/amarokcore'
make[2]: *** [install-recursive] Error 1
make[2]: Leaving directory `/home/stephen/devel/sources/amarok-1.4.3/amarok/src'
make[1]: *** [install-recursive] Error 1
make[1]: Leaving directory `/home/stephen/devel/sources/amarok-1.4.3/amarok'
make: *** [install-recursive] Error 1
stephen@ubuntu:~/devel/sources/amarok-1.4.3$