All pastes #2017 Raw Edit

Anonymous

public text v1 · immutable
#2017 ·published 2004-11-10 13:12 UTC
rendered paste body
    -DBUSYDETECT_MARTIN     -DNEW_PRI_HANGUP    -c -o file.o file.c
gcc -pipe  -Wall -Wstrict-prototypes -Wmissing-prototypes -Wmissing-declarations -g  -Iinclude -I../include  -D_REENTRANT -D_GNU_SOURCE  -O6 -march=i686  -DZAPTEL_OPTIMIZATIONS -DASTERISK_VERSION=\"1.0.2\" -DINSTALL_PREFIX=\"\" -DASTETCDIR=\"/etc/asterisk\" -DASTLIBDIR=\"/usr/lib/asterisk\" -DASTVARLIBDIR=\"/var/lib/asterisk\" -DASTVARRUNDIR=\"/var/run\" -DASTSPOOLDIR=\"/var/spool/asterisk\" -DASTLOGDIR=\"/var/log/asterisk\" -DASTCONFPATH=\"/etc/asterisk/asterisk.conf\" -DASTMODDIR=\"/usr/lib/asterisk/modules\" -DASTAGIDIR=\"/var/lib/asterisk/agi-bin\"     -DBUSYDETECT_MARTIN     -DNEW_PRI_HANGUP    -c -o say.o say.c
say.c:27:28: asterisk/utils.h: No such file or directory
say.c: In function `ast_say_digit_str':
say.c:55: warning: implicit declaration of function `ast_strlen_zero'
say.c: At top level:
say.c:67: warning: no previous prototype for `ast_say_character_str'
say.c:137: warning: no previous prototype for `ast_say_phonetic_str'
say.c:255: warning: no previous prototype for `ast_say_character_str_full'
say.c:323: warning: no previous prototype for `ast_say_phonetic_str_full'
say.c:502: error: conflicting types for `ast_say_number_full'
include/asterisk/say.h:38: error: previous declaration of `ast_say_number_full'
say.c:535: error: conflicting types for `ast_say_number'
include/asterisk/say.h:35: error: previous declaration of `ast_say_number'
make: *** [say.o] Error 1