All pastes #201392 Raw Edit

Unnamed

public text v1 · immutable
#201392 ·published 2006-10-13 20:37 UTC
rendered paste body
/bin/sh ../libtool --tag=CC --mode=link x86_64-pc-linux-gnu-gcc  -O2 -march=k8 -pipe -mno-tls-direct-seg-refs   -o test-poppler-glib  test-poppler-glib.o -lpoppler libpoppler-glib.la -lgdk-x11-2.0 -lgdk_pixbuf-2.0 -lm -lpangocairo-1.0 -lpango-1.0 -lcairo -lgobject-2.0 -lgmodule-2.0 -ldl -lglib-2.0   -lfreetype -lz   ../poppler/libpoppler-cairo.la -lcairo
x86_64-pc-linux-gnu-gcc -O2 -march=k8 -pipe -mno-tls-direct-seg-refs -o .libs/test-poppler-glib test-poppler-glib.o  -L/usr/x86_64-pc-linux-gnu/bin -L/usr/x86_64-pc-linux-gnu/lib ./.libs/libpoppler-glib.so /usr/lib64/libpoppler.so /usr/lib64/libjpeg.so /usr/lib64/libgdk-x11-2.0.so /usr/lib64/libgdk_pixbuf-2.0.so /usr/lib64/libpangocairo-1.0.so /usr/lib64/libpangoft2-1.0.so /usr/lib64/libpango-1.0.so /usr/lib64/libgobject-2.0.so /usr/lib64/libgmodule-2.0.so /usr/lib64/libglib-2.0.so ../poppler/.libs/libpoppler-cairo.a /usr/lib/gcc/x86_64-pc-linux-gnu/3.4.6/libstdc++.so -L/usr/lib/gcc/x86_64-pc-linux-gnu/3.4.6 -L/usr/lib/gcc/x86_64-pc-linux-gnu/3.4.6/../../../../x86_64-pc-linux-gnu/lib -L/usr/lib/gcc/x86_64-pc-linux-gnu/3.4.6/../../../../lib64 -L/lib/../lib64 -L/usr/lib/../lib64 -lgcc_s -lc /usr/lib64/libcairo.so /usr/lib64/libXrender.so /usr/lib64/libX11.so /usr/lib64/libXau.so /usr/lib64/libXdmcp.so -ldl /usr/lib64/libpng12.so /usr/lib64/libglitz.so /usr/lib64/libfontconfig.so /usr/lib64/libexpat.so /usr/lib64/libfreetype.so -lz -lm
/usr/lib64/libpangocairo-1.0.so: undefined reference to `cairo_scaled_font_text_extents'
/usr/lib64/libpangocairo-1.0.so: undefined reference to `cairo_scaled_font_get_ctm'
collect2: ld returned 1 exit status
make[4]: *** [test-poppler-glib] Error 1
make[4]: Leaving directory `/var/tmp/portage/app-text/poppler-bindings-0.5.4/work/poppler-0.5.4/glib'
make[3]: *** [all-recursive] Error 1
make[3]: Leaving directory `/var/tmp/portage/app-text/poppler-bindings-0.5.4/work/poppler-0.5.4/glib'
make[2]: *** [all] Error 2
make[2]: Leaving directory `/var/tmp/portage/app-text/poppler-bindings-0.5.4/work/poppler-0.5.4/glib'
make[1]: *** [all-recursive] Error 1
make[1]: Leaving directory `/var/tmp/portage/app-text/poppler-bindings-0.5.4/work/poppler-0.5.4'
make: *** [all] Error 2

!!! ERROR: app-text/poppler-bindings-0.5.4 failed.
Call stack:
  ebuild.sh, line 1548:   Called dyn_compile
  ebuild.sh, line 937:   Called src_compile
  poppler-bindings-0.5.4.ebuild, line 62:   Called die

!!! compilation failed
!!! If you need support, post the topmost build error, and the call stack if relevant.