All pastes #201240 Raw Edit

Sans titre

public text v1 · immutable
#201240 ·published 2006-10-13 18:29 UTC
rendered paste body
benje@cereli-04:~/v4l-dvb$ make
make -C /home/benje/v4l-dvb/v4l
make[1]: entrant dans le répertoire « /home/benje/v4l-dvb/v4l »
echo "No version yet."
No version yet.
uname -r|perl -ne 'if (/^([0-9]*)\.([0-9])*\.([0-9]*)(.*)$/) { printf ("VERSION= %s\nPATCHLEVEL:=%s\nSUBLEVEL:=%s\nKERNELRELEASE:=%s.%s.%s%s\n",$1,$2,$3,$1,$2,$3 ,$4); };' > ./.version
make[1]: quittant le répertoire « /home/benje/v4l-dvb/v4l »
make[1]: entrant dans le répertoire « /home/benje/v4l-dvb/v4l »
creating symbolic links...
make -C /lib/modules/2.6.15-27-686/build SUBDIRS=/home/benje/v4l-dvb/v4l  module s
make[2]: Entering directory `/usr/src/linux-headers-2.6.15-27-686'
  CC [M]  /home/benje/v4l-dvb/v4l/video-buf.o
  CC [M]  /home/benje/v4l-dvb/v4l/v4l1-compat.o
  CC [M]  /home/benje/v4l-dvb/v4l/v4l2-common.o
  CC [M]  /home/benje/v4l-dvb/v4l/compat_ioctl32.o
  CC [M]  /home/benje/v4l-dvb/v4l/videodev.o
  CC [M]  /home/benje/v4l-dvb/v4l/btcx-risc.o
  CC [M]  /home/benje/v4l-dvb/v4l/flexcop-pci.o
  CC [M]  /home/benje/v4l-dvb/v4l/flexcop-usb.o
  CC [M]  /home/benje/v4l-dvb/v4l/flexcop.o
  CC [M]  /home/benje/v4l-dvb/v4l/flexcop-fe-tuner.o
  CC [M]  /home/benje/v4l-dvb/v4l/flexcop-i2c.o
  CC [M]  /home/benje/v4l-dvb/v4l/flexcop-sram.o
  CC [M]  /home/benje/v4l-dvb/v4l/flexcop-eeprom.o
  CC [M]  /home/benje/v4l-dvb/v4l/flexcop-misc.o
  CC [M]  /home/benje/v4l-dvb/v4l/flexcop-hw-filter.o
  CC [M]  /home/benje/v4l-dvb/v4l/flexcop-dma.o
  CC [M]  /home/benje/v4l-dvb/v4l/bttv-driver.o
  CC [M]  /home/benje/v4l-dvb/v4l/bttv-cards.o
  CC [M]  /home/benje/v4l-dvb/v4l/bttv-risc.o
  CC [M]  /home/benje/v4l-dvb/v4l/bttv-if.o
  CC [M]  /home/benje/v4l-dvb/v4l/bttv-vbi.o
  CC [M]  /home/benje/v4l-dvb/v4l/bttv-i2c.o
  CC [M]  /home/benje/v4l-dvb/v4l/bttv-input.o
  CC [M]  /home/benje/v4l-dvb/v4l/bttv-gpio.o
  CC [M]  /home/benje/v4l-dvb/v4l/cpia2_core.o
  CC [M]  /home/benje/v4l-dvb/v4l/cpia2_usb.o
  CC [M]  /home/benje/v4l-dvb/v4l/cpia2_v4l.o
  CC [M]  /home/benje/v4l-dvb/v4l/cx25840-core.o
  CC [M]  /home/benje/v4l-dvb/v4l/cx25840-audio.o
  CC [M]  /home/benje/v4l-dvb/v4l/cx25840-firmware.o
  CC [M]  /home/benje/v4l-dvb/v4l/cx25840-vbi.o
  CC [M]  /home/benje/v4l-dvb/v4l/cx88-video.o
  CC [M]  /home/benje/v4l-dvb/v4l/cx88-vbi.o
  CC [M]  /home/benje/v4l-dvb/v4l/cx88-mpeg.o
  CC [M]  /home/benje/v4l-dvb/v4l/cx88-cards.o
  CC [M]  /home/benje/v4l-dvb/v4l/cx88-core.o
  CC [M]  /home/benje/v4l-dvb/v4l/cx88-i2c.o
  CC [M]  /home/benje/v4l-dvb/v4l/cx88-tvaudio.o
  CC [M]  /home/benje/v4l-dvb/v4l/cx88-input.o
  CC [M]  /home/benje/v4l-dvb/v4l/dvbdev.o
  CC [M]  /home/benje/v4l-dvb/v4l/dmxdev.o
  CC [M]  /home/benje/v4l-dvb/v4l/dvb_demux.o
  CC [M]  /home/benje/v4l-dvb/v4l/dvb_filter.o
  CC [M]  /home/benje/v4l-dvb/v4l/dvb_ca_en50221.o
  CC [M]  /home/benje/v4l-dvb/v4l/dvb_frontend.o
  CC [M]  /home/benje/v4l-dvb/v4l/dvb_net.o
  CC [M]  /home/benje/v4l-dvb/v4l/dvb_ringbuffer.o
  CC [M]  /home/benje/v4l-dvb/v4l/av7110_hw.o
  CC [M]  /home/benje/v4l-dvb/v4l/av7110_v4l.o
  CC [M]  /home/benje/v4l-dvb/v4l/av7110_av.o
  CC [M]  /home/benje/v4l-dvb/v4l/av7110_ca.o
  CC [M]  /home/benje/v4l-dvb/v4l/av7110.o
  CC [M]  /home/benje/v4l-dvb/v4l/av7110_ipack.o
  CC [M]  /home/benje/v4l-dvb/v4l/av7110_ir.o
  CC [M]  /home/benje/v4l-dvb/v4l/a800.o
  CC [M]  /home/benje/v4l-dvb/v4l/cxusb.o
  CC [M]  /home/benje/v4l-dvb/v4l/dibusb-common.o
  CC [M]  /home/benje/v4l-dvb/v4l/dibusb-mb.o
  CC [M]  /home/benje/v4l-dvb/v4l/dibusb-mc.o
  CC [M]  /home/benje/v4l-dvb/v4l/digitv.o
  CC [M]  /home/benje/v4l-dvb/v4l/dtt200u.o
  CC [M]  /home/benje/v4l-dvb/v4l/dtt200u-fe.o
  CC [M]  /home/benje/v4l-dvb/v4l/nova-t-usb2.o
  CC [M]  /home/benje/v4l-dvb/v4l/umt-010.o
  CC [M]  /home/benje/v4l-dvb/v4l/vp702x.o
  CC [M]  /home/benje/v4l-dvb/v4l/vp702x-fe.o
  CC [M]  /home/benje/v4l-dvb/v4l/vp7045.o
  CC [M]  /home/benje/v4l-dvb/v4l/vp7045-fe.o
  CC [M]  /home/benje/v4l-dvb/v4l/dvb-usb-firmware.o
  CC [M]  /home/benje/v4l-dvb/v4l/dvb-usb-init.o
  CC [M]  /home/benje/v4l-dvb/v4l/dvb-usb-urb.o
  CC [M]  /home/benje/v4l-dvb/v4l/dvb-usb-i2c.o
  CC [M]  /home/benje/v4l-dvb/v4l/dvb-usb-dvb.o
  CC [M]  /home/benje/v4l-dvb/v4l/dvb-usb-remote.o
  CC [M]  /home/benje/v4l-dvb/v4l/em28xx-video.o
In file included from include/sound/pcm.h:62,
                 from /home/benje/v4l-dvb/v4l/em28xx.h:37,
                 from /home/benje/v4l-dvb/v4l/em28xx-video.c:41:
include/sound/pcm_oss.h:68: error: syntax error before 'snd_pcm_substream_t'
include/sound/pcm_oss.h:68: warning: no semicolon at end of struct or union
include/sound/pcm_oss.h:69: warning: type defaults to 'int' in declaration of 's nd_pcm_oss_file_t'
include/sound/pcm_oss.h:69: warning: data definition has no type or storage clas s
include/sound/pcm_oss.h:74: error: syntax error before 'snd_pcm_oss_file_t'
include/sound/pcm_oss.h:74: warning: no semicolon at end of struct or union
include/sound/pcm_oss.h:75: warning: type defaults to 'int' in declaration of 's nd_pcm_oss_substream_t'
include/sound/pcm_oss.h:75: warning: data definition has no type or storage clas s
include/sound/pcm_oss.h:80: error: syntax error before 'snd_info_entry_t'
include/sound/pcm_oss.h:80: warning: no semicolon at end of struct or union
include/sound/pcm_oss.h:81: warning: type defaults to 'int' in declaration of 's nd_pcm_oss_stream_t'
include/sound/pcm_oss.h:81: warning: data definition has no type or storage clas s
In file included from /home/benje/v4l-dvb/v4l/em28xx.h:37,
                 from /home/benje/v4l-dvb/v4l/em28xx-video.c:41:
include/sound/pcm.h:86: error: syntax error before '*' token
include/sound/pcm.h:86: warning: function declaration isn't a prototype
include/sound/pcm.h:87: error: syntax error before '*' token
include/sound/pcm.h:87: warning: function declaration isn't a prototype
include/sound/pcm.h:88: error: syntax error before '*' token
include/sound/pcm.h:89: warning: function declaration isn't a prototype
include/sound/pcm.h:90: error: syntax error before '*' token
include/sound/pcm.h:90: warning: function declaration isn't a prototype
include/sound/pcm.h:91: error: syntax error before '*' token
include/sound/pcm.h:91: warning: function declaration isn't a prototype
include/sound/pcm.h:92: error: syntax error before '*' token
include/sound/pcm.h:92: warning: function declaration isn't a prototype
include/sound/pcm.h:93: error: syntax error before '*' token
include/sound/pcm.h:93: warning: function declaration isn't a prototype
include/sound/pcm.h:94: error: syntax error before '*' token
include/sound/pcm.h:94: warning: function declaration isn't a prototype
include/sound/pcm.h:95: error: syntax error before '*' token
include/sound/pcm.h:96: warning: function declaration isn't a prototype
include/sound/pcm.h:97: error: syntax error before '*' token
include/sound/pcm.h:98: warning: function declaration isn't a prototype
include/sound/pcm.h:99: error: syntax error before '*' token
include/sound/pcm.h:99: warning: function declaration isn't a prototype
include/sound/pcm.h:100: error: syntax error before '*' token
include/sound/pcm.h:100: warning: function declaration isn't a prototype
include/sound/pcm.h:101: error: syntax error before '*' token
include/sound/pcm.h:101: warning: function declaration isn't a prototype
include/sound/pcm.h:216: error: syntax error before 'snd_pcm_substream_t'
include/sound/pcm.h:216: warning: no semicolon at end of struct or union
include/sound/pcm.h:218: error: syntax error before '}' token
include/sound/pcm.h:236: error: syntax error before 'snd_interval_t'
include/sound/pcm.h:236: warning: no semicolon at end of struct or union
include/sound/pcm.h:241: error: syntax error before '}' token
include/sound/pcm.h:241: warning: type defaults to 'int' in declaration of 'snd_ pcm_hw_constraints_t'
include/sound/pcm.h:241: warning: data definition has no type or storage class
include/sound/pcm.h:243: error: syntax error before '*' token
include/sound/pcm.h:245: warning: function declaration isn't a prototype
include/sound/pcm.h: In function 'constrs_mask':
include/sound/pcm.h:246: error: 'constrs' undeclared (first use in this function )
include/sound/pcm.h:246: error: (Each undeclared identifier is reported only onc e
include/sound/pcm.h:246: error: for each function it appears in.)
include/sound/pcm.h:246: error: 'var' undeclared (first use in this function)
include/sound/pcm.h: At top level:
include/sound/pcm.h:249: error: syntax error before '*' token
include/sound/pcm.h:249: error: syntax error before '*' token
include/sound/pcm.h:251: warning: return type defaults to 'int'
include/sound/pcm.h:251: warning: function declaration isn't a prototype
include/sound/pcm.h: In function 'constrs_interval':
include/sound/pcm.h:252: error: 'constrs' undeclared (first use in this function )
include/sound/pcm.h:252: error: 'var' undeclared (first use in this function)
include/sound/pcm.h:253: warning: control reaches end of non-void function
include/sound/pcm.h: At top level:
include/sound/pcm.h:283: error: syntax error before 'snd_pcm_substream_t'
include/sound/pcm.h:283: warning: no semicolon at end of struct or union
include/sound/pcm.h:341: error: syntax error before 'hw_constraints'
include/sound/pcm.h:341: warning: type defaults to 'int' in declaration of 'hw_c onstraints'
include/sound/pcm.h:341: warning: data definition has no type or storage class
include/sound/pcm.h:344: error: syntax error before '*' token
include/sound/pcm.h:344: warning: function declaration isn't a prototype
include/sound/pcm.h:345: error: syntax error before '*' token
include/sound/pcm.h:345: warning: function declaration isn't a prototype
include/sound/pcm.h:361: error: syntax error before '}' token
include/sound/pcm.h:370: error: syntax error before 'snd_pcm_t'
include/sound/pcm.h:370: warning: no semicolon at end of struct or union
include/sound/pcm.h:371: warning: type defaults to 'int' in declaration of 'pstr '
include/sound/pcm.h:371: warning: data definition has no type or storage class
include/sound/pcm.h:385: error: syntax error before '*' token
include/sound/pcm.h:385: warning: type defaults to 'int' in declaration of 'time r'
include/sound/pcm.h:385: warning: data definition has no type or storage class
include/sound/pcm.h:386: error: syntax error before ':' token
include/sound/pcm.h:389: error: syntax error before '*' token
include/sound/pcm.h:389: warning: type defaults to 'int' in declaration of 'next '
include/sound/pcm.h:389: error: conflicting types for 'next'
include/sound/pcm.h:217: error: previous declaration of 'next' was here
include/sound/pcm.h:389: warning: data definition has no type or storage class
include/sound/pcm.h:399: error: syntax error before 'oss'
include/sound/pcm.h:399: warning: type defaults to 'int' in declaration of 'oss'
include/sound/pcm.h:399: error: conflicting types for 'oss'
include/sound/pcm.h:359: error: previous declaration of 'oss' was here
include/sound/pcm.h:399: warning: data definition has no type or storage class
include/sound/pcm.h:401: error: syntax error before '*' token
include/sound/pcm.h:401: warning: type defaults to 'int' in declaration of 'proc _root'
include/sound/pcm.h:401: warning: data definition has no type or storage class
include/sound/pcm.h:402: error: syntax error before '*' token
include/sound/pcm.h:402: warning: type defaults to 'int' in declaration of 'proc _info_entry'
include/sound/pcm.h:402: warning: data definition has no type or storage class
include/sound/pcm.h:403: error: syntax error before '*' token
include/sound/pcm.h:403: warning: type defaults to 'int' in declaration of 'proc _hw_params_entry'
include/sound/pcm.h:403: warning: data definition has no type or storage class
include/sound/pcm.h:404: error: syntax error before '*' token
include/sound/pcm.h:404: warning: type defaults to 'int' in declaration of 'proc _sw_params_entry'
include/sound/pcm.h:404: warning: data definition has no type or storage class
include/sound/pcm.h:405: error: syntax error before '*' token
include/sound/pcm.h:405: warning: type defaults to 'int' in declaration of 'proc _status_entry'
include/sound/pcm.h:405: warning: data definition has no type or storage class
include/sound/pcm.h:406: error: syntax error before '*' token
include/sound/pcm.h:406: warning: type defaults to 'int' in declaration of 'proc _prealloc_entry'
include/sound/pcm.h:406: warning: data definition has no type or storage class
include/sound/pcm.h:408: error: syntax error before ':' token
include/sound/pcm.h:420: error: syntax error before 'snd_pcm_t'
include/sound/pcm.h:420: warning: no semicolon at end of struct or union
include/sound/pcm.h:424: error: syntax error before '*' token
include/sound/pcm.h:424: warning: type defaults to 'int' in declaration of 'subs tream'
include/sound/pcm.h:424: warning: data definition has no type or storage class
include/sound/pcm.h:427: error: syntax error before 'oss'
include/sound/pcm.h:427: warning: type defaults to 'int' in declaration of 'oss'
include/sound/pcm.h:427: error: conflicting types for 'oss'
include/sound/pcm.h:359: error: previous declaration of 'oss' was here
include/sound/pcm.h:427: warning: data definition has no type or storage class
include/sound/pcm.h:430: error: syntax error before '*' token
include/sound/pcm.h:430: warning: type defaults to 'int' in declaration of 'reg'
include/sound/pcm.h:430: warning: data definition has no type or storage class
include/sound/pcm.h:431: error: syntax error before '*' token
include/sound/pcm.h:431: warning: type defaults to 'int' in declaration of 'proc _root'
include/sound/pcm.h:431: warning: data definition has no type or storage class
include/sound/pcm.h:432: error: syntax error before '*' token
include/sound/pcm.h:432: warning: type defaults to 'int' in declaration of 'proc _info_entry'
include/sound/pcm.h:432: warning: data definition has no type or storage class
include/sound/pcm.h:437: error: syntax error before '}' token
include/sound/pcm.h:440: error: syntax error before 'snd_card_t'
include/sound/pcm.h:440: warning: no semicolon at end of struct or union
include/sound/pcm.h:446: error: conflicting types for 'name'
include/sound/pcm.h:374: error: previous declaration of 'name' was here
include/sound/pcm.h:447: error: syntax error before 'streams'
include/sound/pcm.h:447: warning: type defaults to 'int' in declaration of 'stre ams'
include/sound/pcm.h:447: warning: data definition has no type or storage class
include/sound/pcm.h:451: error: syntax error before '*' token
include/sound/pcm.h:451: warning: function declaration isn't a prototype
include/sound/pcm.h:453: error: conflicting types for 'oss'
include/sound/pcm.h:359: error: previous declaration of 'oss' was here
include/sound/pcm.h:455: error: syntax error before '}' token
include/sound/pcm.h:458: error: syntax error before '*' token
include/sound/pcm.h:458: warning: function declaration isn't a prototype
include/sound/pcm.h:459: error: syntax error before '*' token
include/sound/pcm.h:459: warning: function declaration isn't a prototype
include/sound/pcm.h:460: error: syntax error before '*' token
include/sound/pcm.h:460: warning: function declaration isn't a prototype
include/sound/pcm.h:468: error: syntax error before '*' token
include/sound/pcm.h:468: warning: type defaults to 'int' in declaration of 'snd_ pcm_devices'
include/sound/pcm.h:468: warning: data definition has no type or storage class
include/sound/pcm.h:469: error: syntax error before 'snd_pcm_reg'
include/sound/pcm.h:469: warning: type defaults to 'int' in declaration of 'snd_ pcm_reg'
include/sound/pcm.h:469: warning: data definition has no type or storage class
include/sound/pcm.h:471: error: syntax error before '*' token
include/sound/pcm.h:473: warning: function declaration isn't a prototype
include/sound/pcm.h:474: error: syntax error before '*' token
include/sound/pcm.h:474: warning: function declaration isn't a prototype
include/sound/pcm.h:484: error: syntax error before '*' token
include/sound/pcm.h:484: warning: function declaration isn't a prototype
include/sound/pcm.h:485: error: syntax error before '*' token
include/sound/pcm.h:485: warning: function declaration isn't a prototype
include/sound/pcm.h:486: error: syntax error before '*' token
include/sound/pcm.h:486: warning: function declaration isn't a prototype
include/sound/pcm.h:487: error: syntax error before '*' token
include/sound/pcm.h:487: warning: function declaration isn't a prototype
include/sound/pcm.h:488: error: syntax error before '*' token
include/sound/pcm.h:488: warning: function declaration isn't a prototype
include/sound/pcm.h:489: error: syntax error before '*' token
include/sound/pcm.h:489: warning: function declaration isn't a prototype
include/sound/pcm.h:490: error: syntax error before '*' token
include/sound/pcm.h:490: warning: function declaration isn't a prototype
include/sound/pcm.h:492: error: syntax error before '*' token
include/sound/pcm.h:492: warning: function declaration isn't a prototype
include/sound/pcm.h:493: error: syntax error before '*' token
include/sound/pcm.h:493: warning: function declaration isn't a prototype
include/sound/pcm.h:495: error: syntax error before '*' token
include/sound/pcm.h:495: warning: function declaration isn't a prototype
include/sound/pcm.h:496: error: syntax error before '*' token
include/sound/pcm.h:496: warning: function declaration isn't a prototype
include/sound/pcm.h:497: error: syntax error before '*' token
include/sound/pcm.h:497: warning: function declaration isn't a prototype
include/sound/pcm.h:498: error: syntax error before '*' token
include/sound/pcm.h:498: warning: function declaration isn't a prototype
include/sound/pcm.h:499: error: syntax error before '*' token
include/sound/pcm.h:499: warning: function declaration isn't a prototype
include/sound/pcm.h:501: error: syntax error before '*' token
include/sound/pcm.h:501: warning: function declaration isn't a prototype
include/sound/pcm.h:581: error: syntax error before '*' token
include/sound/pcm.h:582: warning: function declaration isn't a prototype
include/sound/pcm.h: In function 'snd_pcm_stream_linked':
include/sound/pcm.h:583: error: request for member 'group' in something not a st ructure or union
include/sound/pcm.h:583: error: request for member 'self_group' in something not  a structure or union
include/sound/pcm.h: At top level:
include/sound/pcm.h:586: error: syntax error before '*' token
include/sound/pcm.h:587: warning: function declaration isn't a prototype
include/sound/pcm.h: In function 'snd_pcm_stream_lock':
include/sound/pcm.h:589: error: request for member 'self_group' in something not  a structure or union
include/sound/pcm.h: At top level:
include/sound/pcm.h:592: error: syntax error before '*' token
include/sound/pcm.h:593: warning: function declaration isn't a prototype
include/sound/pcm.h: In function 'snd_pcm_stream_unlock':
include/sound/pcm.h:594: error: request for member 'self_group' in something not  a structure or union
include/sound/pcm.h: At top level:
include/sound/pcm.h:598: error: syntax error before '*' token
include/sound/pcm.h:599: warning: function declaration isn't a prototype
include/sound/pcm.h: In function 'snd_pcm_stream_lock_irq':
include/sound/pcm.h:601: error: request for member 'self_group' in something not  a structure or union
include/sound/pcm.h: At top level:
include/sound/pcm.h:604: error: syntax error before '*' token
include/sound/pcm.h:605: warning: function declaration isn't a prototype
include/sound/pcm.h: In function 'snd_pcm_stream_unlock_irq':
include/sound/pcm.h:606: error: request for member 'self_group' in something not  a structure or union
include/sound/pcm.h: At top level:
include/sound/pcm.h:628: error: syntax error before '*' token
include/sound/pcm.h:629: warning: function declaration isn't a prototype
include/sound/pcm.h: In function 'snd_pcm_running':
include/sound/pcm.h:630: error: request for member 'runtime' in something not a structure or union
include/sound/pcm.h:631: error: request for member 'runtime' in something not a structure or union
include/sound/pcm.h:632: error: request for member 'stream' in something not a s tructure or union
include/sound/pcm.h: In function 'bytes_to_samples':
include/sound/pcm.h:637: error: dereferencing pointer to incomplete type
include/sound/pcm.h: In function 'bytes_to_frames':
include/sound/pcm.h:642: error: dereferencing pointer to incomplete type
include/sound/pcm.h: In function 'samples_to_bytes':
include/sound/pcm.h:647: error: dereferencing pointer to incomplete type
include/sound/pcm.h: In function 'frames_to_bytes':
include/sound/pcm.h:652: error: dereferencing pointer to incomplete type
include/sound/pcm.h: In function 'frame_aligned':
include/sound/pcm.h:657: error: dereferencing pointer to incomplete type
include/sound/pcm.h: At top level:
include/sound/pcm.h:660: error: syntax error before '*' token
include/sound/pcm.h:661: warning: function declaration isn't a prototype
include/sound/pcm.h: In function 'snd_pcm_lib_buffer_bytes':
include/sound/pcm.h:662: error: request for member 'runtime' in something not a structure or union
include/sound/pcm.h:663: error: dereferencing pointer to incomplete type
include/sound/pcm.h: At top level:
include/sound/pcm.h:666: error: syntax error before '*' token
include/sound/pcm.h:667: warning: function declaration isn't a prototype
include/sound/pcm.h: In function 'snd_pcm_lib_period_bytes':
include/sound/pcm.h:668: error: request for member 'runtime' in something not a structure or union
include/sound/pcm.h:669: error: dereferencing pointer to incomplete type
include/sound/pcm.h: In function 'snd_pcm_playback_avail':
include/sound/pcm.h:677: error: dereferencing pointer to incomplete type
include/sound/pcm.h:677: error: dereferencing pointer to incomplete type
include/sound/pcm.h:677: error: dereferencing pointer to incomplete type
include/sound/pcm.h:679: error: dereferencing pointer to incomplete type
include/sound/pcm.h:680: error: dereferencing pointer to incomplete type
include/sound/pcm.h:681: error: dereferencing pointer to incomplete type
include/sound/pcm.h: In function 'snd_pcm_capture_avail':
include/sound/pcm.h:690: error: dereferencing pointer to incomplete type
include/sound/pcm.h:690: error: dereferencing pointer to incomplete type
include/sound/pcm.h:692: error: dereferencing pointer to incomplete type
include/sound/pcm.h: In function 'snd_pcm_playback_hw_avail':
include/sound/pcm.h:698: error: dereferencing pointer to incomplete type
include/sound/pcm.h: In function 'snd_pcm_capture_hw_avail':
include/sound/pcm.h:703: error: dereferencing pointer to incomplete type
include/sound/pcm.h: At top level:
include/sound/pcm.h:714: error: syntax error before '*' token
include/sound/pcm.h:715: warning: function declaration isn't a prototype
include/sound/pcm.h: In function 'snd_pcm_playback_ready':
include/sound/pcm.h:716: error: request for member 'runtime' in something not a structure or union
include/sound/pcm.h:717: error: dereferencing pointer to incomplete type
include/sound/pcm.h: At top level:
include/sound/pcm.h:728: error: syntax error before '*' token
include/sound/pcm.h:729: warning: function declaration isn't a prototype
include/sound/pcm.h: In function 'snd_pcm_capture_ready':
include/sound/pcm.h:730: error: request for member 'runtime' in something not a structure or union
include/sound/pcm.h:731: error: dereferencing pointer to incomplete type
include/sound/pcm.h: At top level:
include/sound/pcm.h:743: error: syntax error before '*' token
include/sound/pcm.h:744: warning: function declaration isn't a prototype
include/sound/pcm.h: In function 'snd_pcm_playback_data':
include/sound/pcm.h:745: error: request for member 'runtime' in something not a structure or union
include/sound/pcm.h:747: error: dereferencing pointer to incomplete type
include/sound/pcm.h:747: error: dereferencing pointer to incomplete type
include/sound/pcm.h:749: error: dereferencing pointer to incomplete type
include/sound/pcm.h: At top level:
include/sound/pcm.h:760: error: syntax error before '*' token
include/sound/pcm.h:761: warning: function declaration isn't a prototype
include/sound/pcm.h: In function 'snd_pcm_playback_empty':
include/sound/pcm.h:762: error: request for member 'runtime' in something not a structure or union
include/sound/pcm.h:763: error: dereferencing pointer to incomplete type
include/sound/pcm.h: At top level:
include/sound/pcm.h:774: error: syntax error before '*' token
include/sound/pcm.h:775: warning: function declaration isn't a prototype
include/sound/pcm.h: In function 'snd_pcm_capture_empty':
include/sound/pcm.h:776: error: request for member 'runtime' in something not a structure or union
include/sound/pcm.h: At top level:
include/sound/pcm.h:780: error: syntax error before '*' token
include/sound/pcm.h:782: warning: function declaration isn't a prototype
include/sound/pcm.h: In function 'snd_pcm_trigger_done':
include/sound/pcm.h:783: error: request for member 'runtime' in something not a structure or union
include/sound/pcm.h:783: error: 'master' undeclared (first use in this function)
include/sound/pcm.h: At top level:
include/sound/pcm.h:804: error: syntax error before '*' token
include/sound/pcm.h:806: warning: return type defaults to 'int'
include/sound/pcm.h: In function 'hw_param_interval':
include/sound/pcm.h:807: warning: return from incompatible pointer type
include/sound/pcm.h: At top level:
include/sound/pcm.h:816: error: syntax error before '*' token
include/sound/pcm.h:818: warning: return type defaults to 'int'
include/sound/pcm.h: In function 'hw_param_interval_c':
include/sound/pcm.h:819: error: syntax error before 'snd_interval_t'
include/sound/pcm.h:820: warning: control reaches end of non-void function
include/sound/pcm.h: At top level:
include/sound/pcm.h:835: error: syntax error before '*' token
include/sound/pcm.h:835: warning: function declaration isn't a prototype
include/sound/pcm.h:836: warning: type defaults to 'int' in declaration of 'snd_ interval_t'
include/sound/pcm.h:836: error: syntax error before '*' token
include/sound/pcm.h:836: warning: function declaration isn't a prototype
include/sound/pcm.h:837: warning: type defaults to 'int' in declaration of 'snd_ interval_t'
include/sound/pcm.h:837: error: syntax error before '*' token
include/sound/pcm.h:837: warning: function declaration isn't a prototype
include/sound/pcm.h:838: warning: type defaults to 'int' in declaration of 'snd_ interval_t'
include/sound/pcm.h:838: error: syntax error before '*' token
include/sound/pcm.h:839: warning: function declaration isn't a prototype
include/sound/pcm.h:840: warning: type defaults to 'int' in declaration of 'snd_ interval_t'
include/sound/pcm.h:840: error: syntax error before '*' token
include/sound/pcm.h:841: warning: function declaration isn't a prototype
include/sound/pcm.h:842: error: syntax error before '*' token
include/sound/pcm.h:842: warning: function declaration isn't a prototype
include/sound/pcm.h:843: error: syntax error before '*' token
include/sound/pcm.h:845: warning: function declaration isn't a prototype
include/sound/pcm.h:849: error: syntax error before '*' token
include/sound/pcm.h:852: warning: function declaration isn't a prototype
include/sound/pcm.h:853: error: syntax error before '*' token
include/sound/pcm.h:856: warning: function declaration isn't a prototype
include/sound/pcm.h:857: error: syntax error before '*' token
include/sound/pcm.h:857: warning: function declaration isn't a prototype
include/sound/pcm.h:859: error: syntax error before '*' token
include/sound/pcm.h:859: warning: function declaration isn't a prototype
include/sound/pcm.h:861: error: syntax error before '*' token
include/sound/pcm.h:861: warning: function declaration isn't a prototype
include/sound/pcm.h:862: error: syntax error before '*' token
include/sound/pcm.h:862: warning: function declaration isn't a prototype
include/sound/pcm.h:928: error: syntax error before '*' token
include/sound/pcm.h:928: warning: function declaration isn't a prototype
include/sound/pcm.h:929: error: syntax error before '*' token
include/sound/pcm.h:929: warning: function declaration isn't a prototype
include/sound/pcm.h:930: error: syntax error before '*' token
include/sound/pcm.h:930: warning: function declaration isn't a prototype
include/sound/pcm.h:931: error: syntax error before '*' token
include/sound/pcm.h:932: warning: function declaration isn't a prototype
include/sound/pcm.h:933: error: syntax error before '*' token
include/sound/pcm.h:933: warning: function declaration isn't a prototype
include/sound/pcm.h:934: error: syntax error before '*' token
include/sound/pcm.h:934: warning: function declaration isn't a prototype
include/sound/pcm.h:935: error: syntax error before '*' token
include/sound/pcm.h:935: warning: function declaration isn't a prototype
include/sound/pcm.h:936: error: syntax error before '*' token
include/sound/pcm.h:936: warning: function declaration isn't a prototype
include/sound/pcm.h:937: error: syntax error before '*' token
include/sound/pcm.h:937: warning: function declaration isn't a prototype
include/sound/pcm.h:938: error: syntax error before '*' token
include/sound/pcm.h:938: warning: function declaration isn't a prototype
include/sound/pcm.h:939: error: syntax error before '*' token
include/sound/pcm.h:939: warning: function declaration isn't a prototype
include/sound/pcm.h:940: error: syntax error before '*' token
include/sound/pcm.h:940: warning: function declaration isn't a prototype
include/sound/pcm.h:941: error: syntax error before '*' token
include/sound/pcm.h:941: warning: function declaration isn't a prototype
include/sound/pcm.h:942: error: syntax error before '*' token
include/sound/pcm.h:942: warning: function declaration isn't a prototype
include/sound/pcm.h:943: error: syntax error before '*' token
include/sound/pcm.h:945: warning: function declaration isn't a prototype
include/sound/pcm.h:946: error: syntax error before '*' token
include/sound/pcm.h:947: warning: function declaration isn't a prototype
include/sound/pcm.h:948: error: syntax error before '*' token
include/sound/pcm.h:949: warning: function declaration isn't a prototype
include/sound/pcm.h:950: error: syntax error before '*' token
include/sound/pcm.h:951: warning: function declaration isn't a prototype
include/sound/pcm.h:955: error: syntax error before '*' token
include/sound/pcm.h:957: warning: function declaration isn't a prototype
include/sound/pcm.h: In function 'snd_pcm_set_runtime_buffer':
include/sound/pcm.h:958: error: request for member 'runtime' in something not a structure or union
include/sound/pcm.h:959: error: 'bufp' undeclared (first use in this function)
include/sound/pcm.h:960: error: dereferencing pointer to incomplete type
include/sound/pcm.h:961: error: dereferencing pointer to incomplete type
include/sound/pcm.h:962: error: dereferencing pointer to incomplete type
include/sound/pcm.h:963: error: dereferencing pointer to incomplete type
include/sound/pcm.h:965: error: dereferencing pointer to incomplete type
include/sound/pcm.h:966: error: dereferencing pointer to incomplete type
include/sound/pcm.h:967: error: dereferencing pointer to incomplete type
include/sound/pcm.h:968: error: dereferencing pointer to incomplete type
include/sound/pcm.h: At top level:
include/sound/pcm.h:976: error: syntax error before '*' token
include/sound/pcm.h:976: warning: function declaration isn't a prototype
include/sound/pcm.h:977: error: syntax error before '*' token
include/sound/pcm.h:977: warning: function declaration isn't a prototype
include/sound/pcm.h:978: error: syntax error before '*' token
include/sound/pcm.h:978: warning: function declaration isn't a prototype
include/sound/pcm.h:984: error: syntax error before '*' token
include/sound/pcm.h:984: warning: function declaration isn't a prototype
include/sound/pcm.h:985: error: syntax error before '*' token
include/sound/pcm.h:985: warning: function declaration isn't a prototype
include/sound/pcm.h:986: error: syntax error before '*' token
include/sound/pcm.h:988: warning: function declaration isn't a prototype
include/sound/pcm.h:989: error: syntax error before '*' token
include/sound/pcm.h:991: warning: function declaration isn't a prototype
include/sound/pcm.h:992: error: syntax error before '*' token
include/sound/pcm.h:992: warning: function declaration isn't a prototype
include/sound/pcm.h:993: error: syntax error before '*' token
include/sound/pcm.h:993: warning: function declaration isn't a prototype
include/sound/pcm.h:998: error: syntax error before '*' token
include/sound/pcm.h:998: warning: function declaration isn't a prototype
include/sound/pcm.h: In function 'snd_pcm_mmap_data_open':
include/sound/pcm.h:1003: error: 'snd_pcm_substream_t' undeclared (first use in this function)
include/sound/pcm.h:1003: error: syntax error before ')' token
include/sound/pcm.h:1004: error: request for member 'runtime' in something not a  structure or union
include/sound/pcm.h: In function 'snd_pcm_mmap_data_close':
include/sound/pcm.h:1009: error: 'snd_pcm_substream_t' undeclared (first use in this function)
include/sound/pcm.h:1009: error: syntax error before ')' token
include/sound/pcm.h:1010: error: request for member 'runtime' in something not a  structure or union
include/sound/pcm.h: At top level:
include/sound/pcm.h:1016: error: syntax error before '*' token
include/sound/pcm.h:1016: warning: function declaration isn't a prototype
In file included from /home/benje/v4l-dvb/v4l/em28xx.h:38,
                 from /home/benje/v4l-dvb/v4l/em28xx-video.c:41:
include/sound/pcm_params.h:25: error: syntax error before '*' token
include/sound/pcm_params.h:26: warning: function declaration isn't a prototype
include/sound/pcm_params.h:262: error: syntax error before '*' token
include/sound/pcm_params.h:263: warning: function declaration isn't a prototype
include/sound/pcm_params.h: In function 'snd_interval_any':
include/sound/pcm_params.h:264: error: 'i' undeclared (first use in this functio n)
include/sound/pcm_params.h: At top level:
include/sound/pcm_params.h:272: error: syntax error before '*' token
include/sound/pcm_params.h:273: warning: function declaration isn't a prototype
include/sound/pcm_params.h: In function 'snd_interval_none':
include/sound/pcm_params.h:274: error: 'i' undeclared (first use in this functio n)
include/sound/pcm_params.h: At top level:
include/sound/pcm_params.h:277: warning: type defaults to 'int' in declaration o f 'snd_interval_t'
include/sound/pcm_params.h:277: error: syntax error before '*' token
include/sound/pcm_params.h:278: warning: function declaration isn't a prototype
include/sound/pcm_params.h: In function 'snd_interval_checkempty':
include/sound/pcm_params.h:279: error: 'i' undeclared (first use in this functio n)
include/sound/pcm_params.h: At top level:
include/sound/pcm_params.h:283: warning: type defaults to 'int' in declaration o f 'snd_interval_t'
include/sound/pcm_params.h:283: error: syntax error before '*' token
include/sound/pcm_params.h:284: warning: function declaration isn't a prototype
include/sound/pcm_params.h: In function 'snd_interval_empty':
include/sound/pcm_params.h:285: error: 'i' undeclared (first use in this functio n)
include/sound/pcm_params.h: At top level:
include/sound/pcm_params.h:288: warning: type defaults to 'int' in declaration o f 'snd_interval_t'
include/sound/pcm_params.h:288: error: syntax error before '*' token
include/sound/pcm_params.h:289: warning: function declaration isn't a prototype
include/sound/pcm_params.h: In function 'snd_interval_single':
include/sound/pcm_params.h:290: error: 'i' undeclared (first use in this functio n)
include/sound/pcm_params.h: At top level:
include/sound/pcm_params.h:295: warning: type defaults to 'int' in declaration o f 'snd_interval_t'
include/sound/pcm_params.h:295: error: syntax error before '*' token
include/sound/pcm_params.h:296: warning: function declaration isn't a prototype
include/sound/pcm_params.h: In function 'snd_interval_value':
include/sound/pcm_params.h:297: error: 'i' undeclared (first use in this functio n)
include/sound/pcm_params.h: At top level:
include/sound/pcm_params.h:301: warning: type defaults to 'int' in declaration o f 'snd_interval_t'
include/sound/pcm_params.h:301: error: syntax error before '*' token
include/sound/pcm_params.h:302: warning: function declaration isn't a prototype
include/sound/pcm_params.h: In function 'snd_interval_min':
include/sound/pcm_params.h:303: error: 'i' undeclared (first use in this functio n)
include/sound/pcm_params.h: At top level:
include/sound/pcm_params.h:307: warning: type defaults to 'int' in declaration o f 'snd_interval_t'
include/sound/pcm_params.h:307: error: syntax error before '*' token
include/sound/pcm_params.h:308: warning: function declaration isn't a prototype
include/sound/pcm_params.h: In function 'snd_interval_max':
include/sound/pcm_params.h:310: error: 'i' undeclared (first use in this functio n)
include/sound/pcm_params.h: At top level:
include/sound/pcm_params.h:317: warning: type defaults to 'int' in declaration o f 'snd_interval_t'
include/sound/pcm_params.h:317: error: syntax error before '*' token
include/sound/pcm_params.h:318: warning: function declaration isn't a prototype
include/sound/pcm_params.h: In function 'snd_interval_test':
include/sound/pcm_params.h:319: error: 'i' undeclared (first use in this functio n)
include/sound/pcm_params.h:319: error: 'val' undeclared (first use in this funct ion)
include/sound/pcm_params.h: At top level:
include/sound/pcm_params.h:323: error: syntax error before '*' token
include/sound/pcm_params.h:324: warning: function declaration isn't a prototype
include/sound/pcm_params.h: In function 'snd_interval_copy':
include/sound/pcm_params.h:325: error: 'd' undeclared (first use in this functio n)
include/sound/pcm_params.h:325: error: 's' undeclared (first use in this functio n)
include/sound/pcm_params.h: At top level:
include/sound/pcm_params.h:328: error: syntax error before '*' token
include/sound/pcm_params.h:329: warning: function declaration isn't a prototype
include/sound/pcm_params.h: In function 'snd_interval_setinteger':
include/sound/pcm_params.h:330: error: 'i' undeclared (first use in this functio n)
include/sound/pcm_params.h: At top level:
include/sound/pcm_params.h:338: warning: type defaults to 'int' in declaration o f 'snd_interval_t'
include/sound/pcm_params.h:338: error: syntax error before '*' token
include/sound/pcm_params.h:339: warning: function declaration isn't a prototype
include/sound/pcm_params.h: In function 'snd_interval_eq':
include/sound/pcm_params.h:340: error: 'i1' undeclared (first use in this functi on)
include/sound/pcm_params.h:341: error: 'i2' undeclared (first use in this functi on)
make[3]: *** [/home/benje/v4l-dvb/v4l/em28xx-video.o] Error 1
make[2]: *** [_module_/home/benje/v4l-dvb/v4l] Error 2
make[2]: Leaving directory `/usr/src/linux-headers-2.6.15-27-686'
make[1]: *** [default] Erreur 2
make[1]: quittant le répertoire « /home/benje/v4l-dvb/v4l »
make: *** [all] Erreur 2