rendered paste bodyERROR: function do_configure failed
ERROR: see log in /home/repvik/nslu2/openslug/tmp/work/openslug-kernel-2.6.12.2-r10/temp/log.do_configure.5322
NOTE: Task failed: /home/repvik/nslu2/openslug/tmp/work/openslug-kernel-2.6.12.2-r10/temp/log.do_configure.5322
NOTE: package openslug-kernel-2.6.12.2-r10: task do_configure: failed
ERROR: TaskFailed event exception, aborting
NOTE: package openslug-kernel-2.6.12.2: failed
ERROR: Build of openslug-kernel failed
repvik@dev:~/nslu2/openembedded/packages/linux$ cat /home/repvik/nslu2/openslug/tmp/work/openslug-kernel-2.6.12.2-r10/temp/log.do_configure.5322
NOTE: make -e MAKEFLAGS= oldconfig
make[1]: Entering directory `/home/repvik/nslu2/openslug/tmp/work/openslug-kernel-2.6.12.2-r10/linux-2.6.12.2'
HOSTCC scripts/basic/fixdep
scripts/basic/fixdep.c: In function `use_config':
scripts/basic/fixdep.c:201: error: `PATH_MAX' undeclared (first use in this function)
scripts/basic/fixdep.c:201: error: (Each undeclared identifier is reported only once
scripts/basic/fixdep.c:201: error: for each function it appears in.)
scripts/basic/fixdep.c:201: warning: unused variable `s'
scripts/basic/fixdep.c: In function `parse_dep_file':
scripts/basic/fixdep.c:297: error: `PATH_MAX' undeclared (first use in this function)
scripts/basic/fixdep.c:297: warning: unused variable `s'
make[1]: *** [scripts/basic/fixdep] Error 1
make[1]: Leaving directory `/home/repvik/nslu2/openslug/tmp/work/openslug-kernel-2.6.12.2-r10/linux-2.6.12.2'
make: *** [scripts_basic] Error 2
FATAL: oe_runmake failed
yes: standard output: Broken pipe
yes: write error