All pastes #199893 Raw Edit

Something

public text v1 · immutable
#199893 ·published 2006-10-12 20:23 UTC
rendered paste body
 x86_64-pc-linux-gnu-gcc -DHAVE_CONFIG_H -I. -I. -I../.. -I../../include -I../..
/include/quicktime -O3 -funroll-all-loops -fomit-frame-pointer -finline-function
s -Wall -Winline -MT x264.lo -MD -MP -MF .deps/x264.Tpo -c x264.c  -fPIC -DPIC -
o .libs/x264.o
x264.c: In function `avc_find_startcode':
x264.c:163: warning: cast from pointer to integer of different size
x264.c: In function `set_parameter':
x264.c:644: error: structure has no member named `b_cbr'
x264.c:649: error: structure has no member named `b_cbr'
make[3]: *** [x264.lo] Error 1
make[3]: Leaving directory `/var/tmp/portage/libquicktime-0.9.9/work/libquicktim
e-0.9.9/plugins/x264'
make[2]: *** [all-recursive] Error 1
make[2]: Leaving directory `/var/tmp/portage/libquicktime-0.9.9/work/libquicktim
e-0.9.9/plugins'
make[1]: *** [all-recursive] Error 1
make[1]: Leaving directory `/var/tmp/portage/libquicktime-0.9.9/work/libquicktim
e-0.9.9'
make: *** [all] Error 2

!!! ERROR: media-libs/libquicktime-0.9.9 failed.
Call stack:
  ebuild.sh, line 1546:   Called dyn_compile
  ebuild.sh, line 937:   Called src_compile
  libquicktime-0.9.9.ebuild, line 47:   Called die

!!! emake failed
!!! If you need support, post the topmost build error, and the call stack if rel
evant.


revdep-rebuild failed to emerge all packages
you have the following choices: