All pastes #198319 Raw Edit

Someone

public text v1 · immutable
#198319 ·published 2006-10-11 22:07 UTC
rendered paste body
/var/tmp/portage/wxGTK-2.6.2-r1/work/wxWidgets-2.6.2/include/wx/gdicmn.h: In member function 'wxStringToColourHashMap_wxImplementation_HashTable::Node** wxStringToColourHashMap_wxImplementation_HashTable::GetNodePtr(const wxString&) const':
/var/tmp/portage/wxGTK-2.6.2-r1/work/wxWidgets-2.6.2/include/wx/gdicmn.h:476: warning: dereferencing type-punned pointer will break strict-aliasing rules
/var/tmp/portage/wxGTK-2.6.2-r1/work/wxWidgets-2.6.2/src/unix/displayx11.cpp: In static member function 'static size_t wxDisplayBase::GetCount()':
/var/tmp/portage/wxGTK-2.6.2-r1/work/wxWidgets-2.6.2/src/unix/displayx11.cpp:58: error: 'XineramaIsActive' was not declared in this scope
/var/tmp/portage/wxGTK-2.6.2-r1/work/wxWidgets-2.6.2/src/unix/displayx11.cpp:60: error: 'XineramaScreenInfo' was not declared in this scope
/var/tmp/portage/wxGTK-2.6.2-r1/work/wxWidgets-2.6.2/src/unix/displayx11.cpp:60: error: 'screenarr' was not declared in this scope
/var/tmp/portage/wxGTK-2.6.2-r1/work/wxWidgets-2.6.2/src/unix/displayx11.cpp:62: error: 'XineramaQueryScreens' was not declared in this scope
/var/tmp/portage/wxGTK-2.6.2-r1/work/wxWidgets-2.6.2/src/unix/displayx11.cpp: In static member function 'static int wxDisplayBase::GetFromPoint(const wxPoint&)':
/var/tmp/portage/wxGTK-2.6.2-r1/work/wxWidgets-2.6.2/src/unix/displayx11.cpp:76: error: 'XineramaIsActive' was not declared in this scope
/var/tmp/portage/wxGTK-2.6.2-r1/work/wxWidgets-2.6.2/src/unix/displayx11.cpp:79: error: 'XineramaScreenInfo' was not declared in this scope
/var/tmp/portage/wxGTK-2.6.2-r1/work/wxWidgets-2.6.2/src/unix/displayx11.cpp:79: error: 'screenarr' was not declared in this scope
/var/tmp/portage/wxGTK-2.6.2-r1/work/wxWidgets-2.6.2/src/unix/displayx11.cpp:81: error: 'XineramaQueryScreens' was not declared in this scope
/var/tmp/portage/wxGTK-2.6.2-r1/work/wxWidgets-2.6.2/src/unix/displayx11.cpp: In constructor 'wxDisplay::wxDisplay(size_t)':
/var/tmp/portage/wxGTK-2.6.2-r1/work/wxWidgets-2.6.2/src/unix/displayx11.cpp:117: error: 'XineramaIsActive' was not declared in this scope
/var/tmp/portage/wxGTK-2.6.2-r1/work/wxWidgets-2.6.2/src/unix/displayx11.cpp:119: error: 'XineramaScreenInfo' was not declared in this scope
/var/tmp/portage/wxGTK-2.6.2-r1/work/wxWidgets-2.6.2/src/unix/displayx11.cpp:119: error: 'screenarr' was not declared in this scope
/var/tmp/portage/wxGTK-2.6.2-r1/work/wxWidgets-2.6.2/src/unix/displayx11.cpp:121: error: 'XineramaQueryScreens' was not declared in this scope
/var/tmp/portage/wxGTK-2.6.2-r1/work/wxWidgets-2.6.2/src/unix/displayx11.cpp: In static member function 'static int wxDisplayBase::GetFromPoint(const wxPoint&)':
/var/tmp/portage/wxGTK-2.6.2-r1/work/wxWidgets-2.6.2/src/unix/displayx11.cpp:111: warning: control reaches end of non-void function
/var/tmp/portage/wxGTK-2.6.2-r1/work/wxWidgets-2.6.2/src/unix/displayx11.cpp: In static member function 'static size_t wxDisplayBase::GetCount()':
/var/tmp/portage/wxGTK-2.6.2-r1/work/wxWidgets-2.6.2/src/unix/displayx11.cpp:70: warning: control reaches end of non-void function
make: *** [coredll_displayx11.o] Error 1

!!! ERROR: x11-libs/wxGTK-2.6.2-r1 failed.
Call stack:
  ebuild.sh, line 1539:   Called dyn_compile
  ebuild.sh, line 939:   Called src_compile
  wxGTK-2.6.2-r1.ebuild, line 52:   Called configure_build 'gtk2' 'unicode' '
                --with-png
                --with-jpeg
                --with-tiff
                --enable-opengl
                --with-opengl
                --with-gnomeprint
                --with-sdl
                --disable-joystick --with-gtk=2'
  wxlib.eclass, line 45:   Called die

!!! emake failed
!!! If you need support, post the topmost build error, and the call stack if relevant.