i686-pc-linux-gnu-gcc -DHAVE_CONFIG_H -I. -I. -I../../.. -I../../../src/lib/ecore -I../../../src/lib/ecore_evas -I../../../src/lib/ecore -I../../../src/lib/ecore_evas -I../../../src/lib/ecore_x -march=athlon-xp -O3 -pipe -fomit-frame-pointer -Wall -MT ecore_evas.lo -MD -MP -MF .deps/ecore_evas.Tpo -c ecore_evas.c -fPIC -DPIC -o .libs/ecore_evas.o
i686-pc-linux-gnu-gcc -DHAVE_CONFIG_H -I. -I. -I../../.. -I../../../src/lib/ecore -I../../../src/lib/ecore_evas -I../../../src/lib/ecore -I../../../src/lib/ecore_evas -I../../../src/lib/ecore_x -march=athlon-xp -O3 -pipe -fomit-frame-pointer -Wall -MT ecore_evas_x.lo -MD -MP -MF .deps/ecore_evas_x.Tpo -c ecore_evas_x.c -fPIC -DPIC -o .libs/ecore_evas_x.o
i686-pc-linux-gnu-gcc -DHAVE_CONFIG_H -I. -I. -I../../.. -I../../../src/lib/ecore -I../../../src/lib/ecore_evas -I../../../src/lib/ecore -I../../../src/lib/ecore_evas -I../../../src/lib/ecore_x -march=athlon-xp -O3 -pipe -fomit-frame-pointer -Wall -MT ecore_evas_buffer.lo -MD -MP -MF .deps/ecore_evas_buffer.Tpo -c ecore_evas_buffer.c -fPIC -DPIC -o .libs/ecore_evas_buffer.o
i686-pc-linux-gnu-gcc -DHAVE_CONFIG_H -I. -I. -I../../.. -I../../../src/lib/ecore -I../../../src/lib/ecore_evas -I../../../src/lib/ecore -I../../../src/lib/ecore_evas -I../../../src/lib/ecore_x -march=athlon-xp -O3 -pipe -fomit-frame-pointer -Wall -MT ecore_evas_fb.lo -MD -MP -MF .deps/ecore_evas_fb.Tpo -c ecore_evas_fb.c -fPIC -DPIC -o .libs/ecore_evas_fb.o
i686-pc-linux-gnu-gcc -DHAVE_CONFIG_H -I. -I. -I../../.. -I../../../src/lib/ecore -I../../../src/lib/ecore_evas -I../../../src/lib/ecore -I../../../src/lib/ecore_evas -I../../../src/lib/ecore_x -march=athlon-xp -O3 -pipe -fomit-frame-pointer -Wall -MT ecore_evas.lo -MD -MP -MF .deps/ecore_evas.Tpo -c ecore_evas.c -o ecore_evas.o >/dev/null 2>&1
i686-pc-linux-gnu-gcc -DHAVE_CONFIG_H -I. -I. -I../../.. -I../../../src/lib/ecore -I../../../src/lib/ecore_evas -I../../../src/lib/ecore -I../../../src/lib/ecore_evas -I../../../src/lib/ecore_x -march=athlon-xp -O3 -pipe -fomit-frame-pointer -Wall -MT ecore_evas_fb.lo -MD -MP -MF .deps/ecore_evas_fb.Tpo -c ecore_evas_fb.c -o ecore_evas_fb.o >/dev/null 2>&1
ecore_evas_buffer.c: In function `_ecore_evas_mouse_move_process':
ecore_evas_buffer.c:19: warning: passing arg 4 of `evas_event_feed_mouse_move' makes pointer from integer without a cast
ecore_evas_buffer.c:19: error: too many arguments to function `evas_event_feed_mouse_move'
ecore_evas_buffer.c: In function `_ecore_evas_buffer_cb_mouse_in':
ecore_evas_buffer.c:171: error: structure has no member named `timestamp'
ecore_evas_buffer.c:171: error: too many arguments to function `evas_event_feed_mouse_in'
ecore_evas_buffer.c: In function `_ecore_evas_buffer_cb_mouse_out':
ecore_evas_buffer.c:182: error: structure has no member named `timestamp'
ecore_evas_buffer.c:182: error: too many arguments to function `evas_event_feed_mouse_out'
ecore_evas_buffer.c: In function `_ecore_evas_buffer_cb_mouse_down':
ecore_evas_buffer.c:193: error: structure has no member named `timestamp'
ecore_evas_buffer.c:193: error: too many arguments to function `evas_event_feed_mouse_down'
ecore_evas_buffer.c: In function `_ecore_evas_buffer_cb_mouse_up':
ecore_evas_buffer.c:204: error: structure has no member named `timestamp'
ecore_evas_buffer.c:204: error: too many arguments to function `evas_event_feed_mouse_up'
ecore_evas_buffer.c: In function `_ecore_evas_buffer_cb_mouse_move':
ecore_evas_buffer.c:219: error: structure has no member named `timestamp'
ecore_evas_buffer.c: In function `_ecore_evas_buffer_cb_mouse_wheel':
ecore_evas_buffer.c:230: error: structure has no member named `timestamp'
ecore_evas_buffer.c:230: error: too many arguments to function `evas_event_feed_mouse_wheel'
ecore_evas_buffer.c: In function `_ecore_evas_buffer_cb_key_down':
ecore_evas_buffer.c:251: warning: implicit declaration of function `evas_key_modifier_is_set'
ecore_evas_buffer.c:275: warning: implicit declaration of function `evas_key_lock_is_set'
ecore_evas_buffer.c:287: error: structure has no member named `timestamp'
ecore_evas_buffer.c:287: error: too many arguments to function `evas_event_feed_key_down'
ecore_evas_buffer.c: In function `_ecore_evas_buffer_cb_key_up':
ecore_evas_buffer.c:334: error: structure has no member named `timestamp'
ecore_evas_buffer.c:334: error: too many arguments to function `evas_event_feed_key_up'
ecore_evas_buffer.c: In function `ecore_evas_buffer_new':
ecore_evas_buffer.c:495: error: too many arguments to function `evas_event_feed_mouse_in'
make[4]: *** [ecore_evas_buffer.lo] Error 1
make[4]: *** Waiting for unfinished jobs....
ecore_evas_x.c: In function `_ecore_evas_x_mouse_move_process':
ecore_evas_x.c:223: warning: passing arg 4 of `evas_event_feed_mouse_move' makes pointer from integer without a cast
ecore_evas_x.c:223: error: too many arguments to function `evas_event_feed_mouse_move'
ecore_evas_x.c:225: warning: passing arg 4 of `evas_event_feed_mouse_move' makes pointer from integer without a cast
ecore_evas_x.c:225: error: too many arguments to function `evas_event_feed_mouse_move'
ecore_evas_x.c:227: warning: passing arg 4 of `evas_event_feed_mouse_move' makes pointer from integer without a cast
ecore_evas_x.c:227: error: too many arguments to function `evas_event_feed_mouse_move'
ecore_evas_x.c:229: warning: passing arg 4 of `evas_event_feed_mouse_move' makes pointer from integer without a cast
ecore_evas_x.c:229: error: too many arguments to function `evas_event_feed_mouse_move'
ecore_evas_x.c: In function `_ecore_evas_x_event_key_down':
ecore_evas_x.c:338: warning: passing arg 6 of `evas_event_feed_key_down' makes pointer from integer without a cast
ecore_evas_x.c:338: error: too many arguments to function `evas_event_feed_key_down'
ecore_evas_x.c: In function `_ecore_evas_x_event_key_up':
ecore_evas_x.c:352: warning: passing arg 6 of `evas_event_feed_key_up' makes pointer from integer without a cast
ecore_evas_x.c:352: error: too many arguments to function `evas_event_feed_key_up'
ecore_evas_x.c: In function `_ecore_evas_x_event_mouse_button_down':
ecore_evas_x.c:370: warning: passing arg 4 of `evas_event_feed_mouse_down' makes pointer from integer without a cast
ecore_evas_x.c:370: error: too many arguments to function `evas_event_feed_mouse_down'
ecore_evas_x.c: In function `_ecore_evas_x_event_mouse_button_up':
ecore_evas_x.c:385: warning: passing arg 4 of `evas_event_feed_mouse_up' makes pointer from integer without a cast
ecore_evas_x.c:385: error: too many arguments to function `evas_event_feed_mouse_up'
ecore_evas_x.c: In function `_ecore_evas_x_event_mouse_wheel':
ecore_evas_x.c:403: warning: passing arg 4 of `evas_event_feed_mouse_wheel' makes pointer from integer without a cast
ecore_evas_x.c:403: error: too many arguments to function `evas_event_feed_mouse_wheel'
ecore_evas_x.c: In function `_ecore_evas_x_event_mouse_in':
ecore_evas_x.c:435: warning: passing arg 2 of `evas_event_feed_mouse_in' makes pointer from integer without a cast
ecore_evas_x.c:435: error: too many arguments to function `evas_event_feed_mouse_in'
ecore_evas_x.c: In function `_ecore_evas_x_event_mouse_out':
ecore_evas_x.c:453: warning: passing arg 2 of `evas_event_feed_mouse_out' makes pointer from integer without a cast
ecore_evas_x.c:453: error: too many arguments to function `evas_event_feed_mouse_out'
make[4]: *** [ecore_evas_x.lo] Error 1
make[3]: *** [all-recursive] Error 1
make[3]: Leaving directory `/var/tmp/portage/ecore-9999/work/e17/libs/ecore/src/lib'
make[2]: *** [all-recursive] Error 1
make[2]: Leaving directory `/var/tmp/portage/ecore-9999/work/e17/libs/ecore/src'
make[1]: *** [all-recursive] Error 1
make[1]: Leaving directory `/var/tmp/portage/ecore-9999/work/e17/libs/ecore'
make: *** [all] Error 2