All pastes #19718 Raw Edit

Miscellany

public text v1 · immutable
#19718 ·published 2005-08-10 15:27 UTC
rendered paste body
[rsmith@rsmith]:~/nss-3.10/mozilla/security/nss$ make
cd lib; make export
make[1]: Entering directory `/home/rsmith/nss-3.10/mozilla/security/nss/lib'
cd util; make export
make[2]: Entering directory `/home/rsmith/nss-3.10/mozilla/security/nss/lib/util'
Creating ../../../../dist/public/nss
../../../coreconf/nsinstall/Linux2.6_x86_glibc_PTH_DBG.OBJ/nsinstall -R -m 444 base64.h ciferfam.h nssb64.h nssb64t.h nsslocks.h nssilock.h nssilckt.h nssrwlk.h nssrwlkt.h portreg.h secasn1.h secasn1t.h seccomon.h secder.h secdert.h secdig.h secdigt.h secitem.h secoid.h secoidt.h secport.h secerr.h watcomfx.h ../../../../dist/public/nss
Creating ../../../../dist/private/nss
../../../coreconf/nsinstall/Linux2.6_x86_glibc_PTH_DBG.OBJ/nsinstall -R -m 444 pqgutil.h ../../../../dist/private/nss
make[2]: Leaving directory `/home/rsmith/nss-3.10/mozilla/security/nss/lib/util'
cd freebl; make export
make[2]: Entering directory `/home/rsmith/nss-3.10/mozilla/security/nss/lib/freebl'
../../../coreconf/nsinstall/Linux2.6_x86_glibc_PTH_DBG.OBJ/nsinstall -R -m 444 blapit.h shsign.h ecl/ecl-exp.h ../../../../dist/public/nss
../../../coreconf/nsinstall/Linux2.6_x86_glibc_PTH_DBG.OBJ/nsinstall -R -m 444 blapi.h secmpi.h secrng.h ec.h ecl/ecl.h ecl/ecl-curve.h ../../../../dist/private/nss
make[2]: Leaving directory `/home/rsmith/nss-3.10/mozilla/security/nss/lib/freebl'
cd softoken; make export
make[2]: Entering directory `/home/rsmith/nss-3.10/mozilla/security/nss/lib/softoken'
../../../coreconf/nsinstall/Linux2.6_x86_glibc_PTH_DBG.OBJ/nsinstall -R -m 444 pkcs11.h pkcs11f.h pkcs11p.h pkcs11t.h pkcs11n.h pkcs11u.h ../../../../dist/public/nss
../../../coreconf/nsinstall/Linux2.6_x86_glibc_PTH_DBG.OBJ/nsinstall -R -m 444 pk11pars.h ../../../../dist/private/nss
make[2]: Leaving directory `/home/rsmith/nss-3.10/mozilla/security/nss/lib/softoken'
cd base; make export
make[2]: Entering directory `/home/rsmith/nss-3.10/mozilla/security/nss/lib/base'
../../../coreconf/nsinstall/Linux2.6_x86_glibc_PTH_DBG.OBJ/nsinstall -R -m 444 nssbaset.h nssbase.h ../../../../dist/public/nss
../../../coreconf/nsinstall/Linux2.6_x86_glibc_PTH_DBG.OBJ/nsinstall -R -m 444 baset.h base.h ../../../../dist/private/nss
make[2]: Leaving directory `/home/rsmith/nss-3.10/mozilla/security/nss/lib/base'
cd asn1; make export
make[2]: Entering directory `/home/rsmith/nss-3.10/mozilla/security/nss/lib/asn1'
../../../coreconf/nsinstall/Linux2.6_x86_glibc_PTH_DBG.OBJ/nsinstall -R -m 444 asn1t.h asn1m.h asn1.h nssasn1t.h ../../../../dist/private/nss
make[2]: Leaving directory `/home/rsmith/nss-3.10/mozilla/security/nss/lib/asn1'
cd dev; make export
make[2]: Entering directory `/home/rsmith/nss-3.10/mozilla/security/nss/lib/dev'
../../../coreconf/nsinstall/Linux2.6_x86_glibc_PTH_DBG.OBJ/nsinstall -R -m 444 ckhelper.h devt.h dev.h nssdevt.h nssdev.h devm.h devtm.h ../../../../dist/private/nss
make[2]: Leaving directory `/home/rsmith/nss-3.10/mozilla/security/nss/lib/dev'
cd pki; make export
make[2]: Entering directory `/home/rsmith/nss-3.10/mozilla/security/nss/lib/pki'
../../../coreconf/nsinstall/Linux2.6_x86_glibc_PTH_DBG.OBJ/nsinstall -R -m 444 pki.h pkit.h nsspkit.h nsspki.h pkistore.h pki3hack.h pkitm.h pkim.h ../../../../dist/private/nss
make[2]: Leaving directory `/home/rsmith/nss-3.10/mozilla/security/nss/lib/pki'
cd pki1; make export
make[2]: Entering directory `/home/rsmith/nss-3.10/mozilla/security/nss/lib/pki1'
../../../coreconf/nsinstall/Linux2.6_x86_glibc_PTH_DBG.OBJ/nsinstall -R -m 444 oiddata.h pki1.h pki1t.h nsspki1.h nsspki1t.h ../../../../dist/private/nss
make[2]: Leaving directory `/home/rsmith/nss-3.10/mozilla/security/nss/lib/pki1'
cd certdb; make export
make[2]: Entering directory `/home/rsmith/nss-3.10/mozilla/security/nss/lib/certdb'
../../../coreconf/nsinstall/Linux2.6_x86_glibc_PTH_DBG.OBJ/nsinstall -R -m 444 cert.h certt.h certdb.h ../../../../dist/public/nss
../../../coreconf/nsinstall/Linux2.6_x86_glibc_PTH_DBG.OBJ/nsinstall -R -m 444 genname.h xconst.h certxutl.h certi.h ../../../../dist/private/nss
make[2]: Leaving directory `/home/rsmith/nss-3.10/mozilla/security/nss/lib/certdb'
cd certhigh; make export
make[2]: Entering directory `/home/rsmith/nss-3.10/mozilla/security/nss/lib/certhigh'
../../../coreconf/nsinstall/Linux2.6_x86_glibc_PTH_DBG.OBJ/nsinstall -R -m 444 ocsp.h ocspt.h ../../../../dist/public/nss
../../../coreconf/nsinstall/Linux2.6_x86_glibc_PTH_DBG.OBJ/nsinstall -R -m 444 ocspti.h ../../../../dist/private/nss
make[2]: Leaving directory `/home/rsmith/nss-3.10/mozilla/security/nss/lib/certhigh'
cd pk11wrap; make export
make[2]: Entering directory `/home/rsmith/nss-3.10/mozilla/security/nss/lib/pk11wrap'
../../../coreconf/nsinstall/Linux2.6_x86_glibc_PTH_DBG.OBJ/nsinstall -R -m 444 secmod.h secmodt.h secpkcs5.h pk11func.h pk11pub.h pk11priv.h pk11sdr.h pk11pqg.h ../../../../dist/public/nss
../../../coreconf/nsinstall/Linux2.6_x86_glibc_PTH_DBG.OBJ/nsinstall -R -m 444 secmodi.h pk11init.h dev3hack.h ../../../../dist/private/nssmake[2]: Leaving directory `/home/rsmith/nss-3.10/mozilla/security/nss/lib/pk11wrap'
cd cryptohi; make export
make[2]: Entering directory `/home/rsmith/nss-3.10/mozilla/security/nss/lib/cryptohi'
../../../coreconf/nsinstall/Linux2.6_x86_glibc_PTH_DBG.OBJ/nsinstall -R -m 444 cryptohi.h cryptoht.h hasht.h key.h keyhi.h keyt.h keythi.h sechash.h ../../../../dist/public/nss
There are no private exports.
make[2]: Leaving directory `/home/rsmith/nss-3.10/mozilla/security/nss/lib/cryptohi'
cd nss; make export
make[2]: Entering directory `/home/rsmith/nss-3.10/mozilla/security/nss/lib/nss'
../../../coreconf/nsinstall/Linux2.6_x86_glibc_PTH_DBG.OBJ/nsinstall -R -m 444 nss.h ../../../../dist/public/nss
../../../coreconf/nsinstall/Linux2.6_x86_glibc_PTH_DBG.OBJ/nsinstall -R -m 444 nssrenam.h ../../../../dist/private/nss
make[2]: Leaving directory `/home/rsmith/nss-3.10/mozilla/security/nss/lib/nss'
cd ssl; make export
make[2]: Entering directory `/home/rsmith/nss-3.10/mozilla/security/nss/lib/ssl'
../../../coreconf/nsinstall/Linux2.6_x86_glibc_PTH_DBG.OBJ/nsinstall -R -m 444 ssl.h sslt.h sslerr.h sslproto.h preenc.h ../../../../dist/public/nss
../../../coreconf/nsinstall/Linux2.6_x86_glibc_PTH_DBG.OBJ/nsinstall -R -m 444 ssl3prot.h sslimpl.h ../../../../dist/private/nss
make[2]: Leaving directory `/home/rsmith/nss-3.10/mozilla/security/nss/lib/ssl'
cd pkcs12; make export
make[2]: Entering directory `/home/rsmith/nss-3.10/mozilla/security/nss/lib/pkcs12'
../../../coreconf/nsinstall/Linux2.6_x86_glibc_PTH_DBG.OBJ/nsinstall -R -m 444 pkcs12t.h pkcs12.h p12plcy.h p12.h p12t.h ../../../../dist/public/nss
make[2]: Leaving directory `/home/rsmith/nss-3.10/mozilla/security/nss/lib/pkcs12'
cd pkcs7; make export
make[2]: Entering directory `/home/rsmith/nss-3.10/mozilla/security/nss/lib/pkcs7'
../../../coreconf/nsinstall/Linux2.6_x86_glibc_PTH_DBG.OBJ/nsinstall -R -m 444 secmime.h secpkcs7.h pkcs7t.h ../../../../dist/public/nss
make[2]: Leaving directory `/home/rsmith/nss-3.10/mozilla/security/nss/lib/pkcs7'
cd smime; make export
make[2]: Entering directory `/home/rsmith/nss-3.10/mozilla/security/nss/lib/smime'
../../../coreconf/nsinstall/Linux2.6_x86_glibc_PTH_DBG.OBJ/nsinstall -R -m 444 cms.h cmst.h smime.h cmsreclist.h ../../../../dist/public/nss
make[2]: Leaving directory `/home/rsmith/nss-3.10/mozilla/security/nss/lib/smime'
cd crmf; make export
make[2]: Entering directory `/home/rsmith/nss-3.10/mozilla/security/nss/lib/crmf'
../../../coreconf/nsinstall/Linux2.6_x86_glibc_PTH_DBG.OBJ/nsinstall -R -m 444 crmf.h crmft.h cmmf.h cmmft.h ../../../../dist/public/nss
../../../coreconf/nsinstall/Linux2.6_x86_glibc_PTH_DBG.OBJ/nsinstall -R -m 444 crmfi.h crmfit.h cmmfi.h cmmfit.h ../../../../dist/private/nss
make[2]: Leaving directory `/home/rsmith/nss-3.10/mozilla/security/nss/lib/crmf'
cd jar; make export
make[2]: Entering directory `/home/rsmith/nss-3.10/mozilla/security/nss/lib/jar'
../../../coreconf/nsinstall/Linux2.6_x86_glibc_PTH_DBG.OBJ/nsinstall -R -m 444 jar.h jar-ds.h jarfile.h ../../../../dist/public/nss
make[2]: Leaving directory `/home/rsmith/nss-3.10/mozilla/security/nss/lib/jar'
cd ckfw; make export
make[2]: Entering directory `/home/rsmith/nss-3.10/mozilla/security/nss/lib/ckfw'
cd builtins; make export
make[3]: Entering directory `/home/rsmith/nss-3.10/mozilla/security/nss/lib/ckfw/builtins'
../../../../coreconf/nsinstall/Linux2.6_x86_glibc_PTH_DBG.OBJ/nsinstall -R -m 444 nssckbi.h ../../../../../dist/public/nss
make[3]: Leaving directory `/home/rsmith/nss-3.10/mozilla/security/nss/lib/ckfw/builtins'
../../../coreconf/nsinstall/Linux2.6_x86_glibc_PTH_DBG.OBJ/nsinstall -R -m 444 nssck.api nssckepv.h nssckft.h nssckfw.h nssckfwc.h nssckfwt.h nssckg.h nssckmdt.h nssckt.h ../../../../dist/public/nss
cd builtins; make private_export
make[3]: Entering directory `/home/rsmith/nss-3.10/mozilla/security/nss/lib/ckfw/builtins'
There are no private exports.
make[3]: Leaving directory `/home/rsmith/nss-3.10/mozilla/security/nss/lib/ckfw/builtins'
../../../coreconf/nsinstall/Linux2.6_x86_glibc_PTH_DBG.OBJ/nsinstall -R -m 444 ck.h ckfw.h ckfwm.h ckfwtm.h ckmd.h ckt.h ../../../../dist/private/nss
make[2]: Leaving directory `/home/rsmith/nss-3.10/mozilla/security/nss/lib/ckfw'
cd fortcrypt; make export
make[2]: Entering directory `/home/rsmith/nss-3.10/mozilla/security/nss/lib/fortcrypt'
cd swfort; make export
make[3]: Entering directory `/home/rsmith/nss-3.10/mozilla/security/nss/lib/fortcrypt/swfort'
cd pkcs11; make export
make[4]: Entering directory `/home/rsmith/nss-3.10/mozilla/security/nss/lib/fortcrypt/swfort/pkcs11'
make[4]: Nothing to be done for `export'.
make[4]: Leaving directory `/home/rsmith/nss-3.10/mozilla/security/nss/lib/fortcrypt/swfort/pkcs11'
../../../../coreconf/nsinstall/Linux2.6_x86_glibc_PTH_DBG.OBJ/nsinstall -R -m 444 swfort.h swfortt.h ../../../../../dist/public/nss
rm -f Linux2.6_x86_glibc_PTH_DBG.OBJ/nslib.c
cat nsmap.h swflib.c > Linux2.6_x86_glibc_PTH_DBG.OBJ/nslib.c
cd pkcs11; make private_export
make[4]: Entering directory `/home/rsmith/nss-3.10/mozilla/security/nss/lib/fortcrypt/swfort/pkcs11'
There are no private exports.
make[4]: Leaving directory `/home/rsmith/nss-3.10/mozilla/security/nss/lib/fortcrypt/swfort/pkcs11'
../../../../coreconf/nsinstall/Linux2.6_x86_glibc_PTH_DBG.OBJ/nsinstall -R -m 444 swforti.h swfortti.h ../../../../../dist/private/nss
make[3]: Leaving directory `/home/rsmith/nss-3.10/mozilla/security/nss/lib/fortcrypt/swfort'
cd swfort; make private_export
make[3]: Entering directory `/home/rsmith/nss-3.10/mozilla/security/nss/lib/fortcrypt/swfort'
cd pkcs11; make private_export
make[4]: Entering directory `/home/rsmith/nss-3.10/mozilla/security/nss/lib/fortcrypt/swfort/pkcs11'
There are no private exports.
make[4]: Leaving directory `/home/rsmith/nss-3.10/mozilla/security/nss/lib/fortcrypt/swfort/pkcs11'
../../../../coreconf/nsinstall/Linux2.6_x86_glibc_PTH_DBG.OBJ/nsinstall -R -m 444 swforti.h swfortti.h ../../../../../dist/private/nss
make[3]: Leaving directory `/home/rsmith/nss-3.10/mozilla/security/nss/lib/fortcrypt/swfort'
../../../coreconf/nsinstall/Linux2.6_x86_glibc_PTH_DBG.OBJ/nsinstall -R -m 444 maci.h cryptint.h ../../../../dist/private/nss
make[2]: Leaving directory `/home/rsmith/nss-3.10/mozilla/security/nss/lib/fortcrypt'
make[1]: Leaving directory `/home/rsmith/nss-3.10/mozilla/security/nss/lib'
cd cmd; make export
make[1]: Entering directory `/home/rsmith/nss-3.10/mozilla/security/nss/cmd'
cd lib; make export
make[2]: Entering directory `/home/rsmith/nss-3.10/mozilla/security/nss/cmd/lib'
../../../coreconf/nsinstall/Linux2.6_x86_glibc_PTH_DBG.OBJ/nsinstall -R -m 444 secutil.h ../../../../dist/private/nss
make[2]: Leaving directory `/home/rsmith/nss-3.10/mozilla/security/nss/cmd/lib'
cd zlib; make export
make[2]: Entering directory `/home/rsmith/nss-3.10/mozilla/security/nss/cmd/zlib'
../../../coreconf/nsinstall/Linux2.6_x86_glibc_PTH_DBG.OBJ/nsinstall -R -m 444 zlib.h zconf.h ../../../../dist/private/nss
make[2]: Leaving directory `/home/rsmith/nss-3.10/mozilla/security/nss/cmd/zlib'
cd addbuiltin; make export
make[2]: Entering directory `/home/rsmith/nss-3.10/mozilla/security/nss/cmd/addbuiltin'
make[2]: Nothing to be done for `export'.
make[2]: Leaving directory `/home/rsmith/nss-3.10/mozilla/security/nss/cmd/addbuiltin'
cd atob; make export
make[2]: Entering directory `/home/rsmith/nss-3.10/mozilla/security/nss/cmd/atob'
make[2]: Nothing to be done for `export'.
make[2]: Leaving directory `/home/rsmith/nss-3.10/mozilla/security/nss/cmd/atob'
cd bltest; make export
make[2]: Entering directory `/home/rsmith/nss-3.10/mozilla/security/nss/cmd/bltest'
make[2]: Nothing to be done for `export'.
make[2]: Leaving directory `/home/rsmith/nss-3.10/mozilla/security/nss/cmd/bltest'
cd btoa; make export
make[2]: Entering directory `/home/rsmith/nss-3.10/mozilla/security/nss/cmd/btoa'
make[2]: Nothing to be done for `export'.
make[2]: Leaving directory `/home/rsmith/nss-3.10/mozilla/security/nss/cmd/btoa'
cd certcgi; make export
make[2]: Entering directory `/home/rsmith/nss-3.10/mozilla/security/nss/cmd/certcgi'
make[2]: Nothing to be done for `export'.
make[2]: Leaving directory `/home/rsmith/nss-3.10/mozilla/security/nss/cmd/certcgi'
cd certutil; make export
make[2]: Entering directory `/home/rsmith/nss-3.10/mozilla/security/nss/cmd/certutil'
make[2]: Nothing to be done for `export'.
make[2]: Leaving directory `/home/rsmith/nss-3.10/mozilla/security/nss/cmd/certutil'
cd checkcert; make export
make[2]: Entering directory `/home/rsmith/nss-3.10/mozilla/security/nss/cmd/checkcert'
make[2]: Nothing to be done for `export'.
make[2]: Leaving directory `/home/rsmith/nss-3.10/mozilla/security/nss/cmd/checkcert'
cd crlutil; make export
make[2]: Entering directory `/home/rsmith/nss-3.10/mozilla/security/nss/cmd/crlutil'
make[2]: Nothing to be done for `export'.
make[2]: Leaving directory `/home/rsmith/nss-3.10/mozilla/security/nss/cmd/crlutil'
cd dbtest; make export
make[2]: Entering directory `/home/rsmith/nss-3.10/mozilla/security/nss/cmd/dbtest'
make[2]: Nothing to be done for `export'.
make[2]: Leaving directory `/home/rsmith/nss-3.10/mozilla/security/nss/cmd/dbtest'
cd derdump; make export
make[2]: Entering directory `/home/rsmith/nss-3.10/mozilla/security/nss/cmd/derdump'
make[2]: Nothing to be done for `export'.
make[2]: Leaving directory `/home/rsmith/nss-3.10/mozilla/security/nss/cmd/derdump'
cd digest; make export
make[2]: Entering directory `/home/rsmith/nss-3.10/mozilla/security/nss/cmd/digest'
make[2]: Nothing to be done for `export'.
make[2]: Leaving directory `/home/rsmith/nss-3.10/mozilla/security/nss/cmd/digest'
cd makepqg; make export
make[2]: Entering directory `/home/rsmith/nss-3.10/mozilla/security/nss/cmd/makepqg'
make[2]: Nothing to be done for `export'.
make[2]: Leaving directory `/home/rsmith/nss-3.10/mozilla/security/nss/cmd/makepqg'
cd ocspclnt; make export
make[2]: Entering directory `/home/rsmith/nss-3.10/mozilla/security/nss/cmd/ocspclnt'
make[2]: Nothing to be done for `export'.
make[2]: Leaving directory `/home/rsmith/nss-3.10/mozilla/security/nss/cmd/ocspclnt'
cd oidcalc; make export
make[2]: Entering directory `/home/rsmith/nss-3.10/mozilla/security/nss/cmd/oidcalc'
make[2]: Nothing to be done for `export'.
make[2]: Leaving directory `/home/rsmith/nss-3.10/mozilla/security/nss/cmd/oidcalc'
cd p7content; make export
make[2]: Entering directory `/home/rsmith/nss-3.10/mozilla/security/nss/cmd/p7content'
make[2]: Nothing to be done for `export'.
make[2]: Leaving directory `/home/rsmith/nss-3.10/mozilla/security/nss/cmd/p7content'
cd p7env; make export
make[2]: Entering directory `/home/rsmith/nss-3.10/mozilla/security/nss/cmd/p7env'
make[2]: Nothing to be done for `export'.
make[2]: Leaving directory `/home/rsmith/nss-3.10/mozilla/security/nss/cmd/p7env'
cd p7sign; make export
make[2]: Entering directory `/home/rsmith/nss-3.10/mozilla/security/nss/cmd/p7sign'
make[2]: Nothing to be done for `export'.
make[2]: Leaving directory `/home/rsmith/nss-3.10/mozilla/security/nss/cmd/p7sign'
cd p7verify; make export
make[2]: Entering directory `/home/rsmith/nss-3.10/mozilla/security/nss/cmd/p7verify'
make[2]: Nothing to be done for `export'.
make[2]: Leaving directory `/home/rsmith/nss-3.10/mozilla/security/nss/cmd/p7verify'
cd pk12util; make export
make[2]: Entering directory `/home/rsmith/nss-3.10/mozilla/security/nss/cmd/pk12util'
make[2]: Nothing to be done for `export'.
make[2]: Leaving directory `/home/rsmith/nss-3.10/mozilla/security/nss/cmd/pk12util'
cd pp; make export
make[2]: Entering directory `/home/rsmith/nss-3.10/mozilla/security/nss/cmd/pp'
make[2]: Nothing to be done for `export'.
make[2]: Leaving directory `/home/rsmith/nss-3.10/mozilla/security/nss/cmd/pp'
cd rsaperf; make export
make[2]: Entering directory `/home/rsmith/nss-3.10/mozilla/security/nss/cmd/rsaperf'
make[2]: Nothing to be done for `export'.
make[2]: Leaving directory `/home/rsmith/nss-3.10/mozilla/security/nss/cmd/rsaperf'
cd sdrtest; make export
make[2]: Entering directory `/home/rsmith/nss-3.10/mozilla/security/nss/cmd/sdrtest'
make[2]: Nothing to be done for `export'.
make[2]: Leaving directory `/home/rsmith/nss-3.10/mozilla/security/nss/cmd/sdrtest'
cd selfserv; make export
make[2]: Entering directory `/home/rsmith/nss-3.10/mozilla/security/nss/cmd/selfserv'
make[2]: Nothing to be done for `export'.
make[2]: Leaving directory `/home/rsmith/nss-3.10/mozilla/security/nss/cmd/selfserv'
cd signtool; make export
make[2]: Entering directory `/home/rsmith/nss-3.10/mozilla/security/nss/cmd/signtool'
make[2]: Nothing to be done for `export'.
make[2]: Leaving directory `/home/rsmith/nss-3.10/mozilla/security/nss/cmd/signtool'
cd signver; make export
make[2]: Entering directory `/home/rsmith/nss-3.10/mozilla/security/nss/cmd/signver'
make[2]: Nothing to be done for `export'.
make[2]: Leaving directory `/home/rsmith/nss-3.10/mozilla/security/nss/cmd/signver'
cd shlibsign; make export
make[2]: Entering directory `/home/rsmith/nss-3.10/mozilla/security/nss/cmd/shlibsign'
cd mangle; make export
make[3]: Entering directory `/home/rsmith/nss-3.10/mozilla/security/nss/cmd/shlibsign/mangle'
make[3]: Nothing to be done for `export'.
make[3]: Leaving directory `/home/rsmith/nss-3.10/mozilla/security/nss/cmd/shlibsign/mangle'
make[2]: Leaving directory `/home/rsmith/nss-3.10/mozilla/security/nss/cmd/shlibsign'
cd smimetools; make export
make[2]: Entering directory `/home/rsmith/nss-3.10/mozilla/security/nss/cmd/smimetools'
make[2]: Nothing to be done for `export'.
make[2]: Leaving directory `/home/rsmith/nss-3.10/mozilla/security/nss/cmd/smimetools'
cd SSLsample; make export
make[2]: Entering directory `/home/rsmith/nss-3.10/mozilla/security/nss/cmd/SSLsample'
make -f make.client export
make[3]: Entering directory `/home/rsmith/nss-3.10/mozilla/security/nss/cmd/SSLsample'
make[3]: Nothing to be done for `export'.
make[3]: Leaving directory `/home/rsmith/nss-3.10/mozilla/security/nss/cmd/SSLsample'
make -f make.server export
make[3]: Entering directory `/home/rsmith/nss-3.10/mozilla/security/nss/cmd/SSLsample'
make[3]: Nothing to be done for `export'.
make[3]: Leaving directory `/home/rsmith/nss-3.10/mozilla/security/nss/cmd/SSLsample'
make[2]: Leaving directory `/home/rsmith/nss-3.10/mozilla/security/nss/cmd/SSLsample'
cd ssltap; make export
make[2]: Entering directory `/home/rsmith/nss-3.10/mozilla/security/nss/cmd/ssltap'
make[2]: Nothing to be done for `export'.
make[2]: Leaving directory `/home/rsmith/nss-3.10/mozilla/security/nss/cmd/ssltap'
cd strsclnt; make export
make[2]: Entering directory `/home/rsmith/nss-3.10/mozilla/security/nss/cmd/strsclnt'
make[2]: Nothing to be done for `export'.
make[2]: Leaving directory `/home/rsmith/nss-3.10/mozilla/security/nss/cmd/strsclnt'
cd swfort; make export
make[2]: Entering directory `/home/rsmith/nss-3.10/mozilla/security/nss/cmd/swfort'
cd instinit; make export
make[3]: Entering directory `/home/rsmith/nss-3.10/mozilla/security/nss/cmd/swfort/instinit'
make[3]: Nothing to be done for `export'.
make[3]: Leaving directory `/home/rsmith/nss-3.10/mozilla/security/nss/cmd/swfort/instinit'
cd newuser; make export
make[3]: Entering directory `/home/rsmith/nss-3.10/mozilla/security/nss/cmd/swfort/newuser'
make[3]: Nothing to be done for `export'.
make[3]: Leaving directory `/home/rsmith/nss-3.10/mozilla/security/nss/cmd/swfort/newuser'
make[2]: Leaving directory `/home/rsmith/nss-3.10/mozilla/security/nss/cmd/swfort'
cd symkeyutil; make export
make[2]: Entering directory `/home/rsmith/nss-3.10/mozilla/security/nss/cmd/symkeyutil'
make[2]: Nothing to be done for `export'.
make[2]: Leaving directory `/home/rsmith/nss-3.10/mozilla/security/nss/cmd/symkeyutil'
cd tstclnt; make export
make[2]: Entering directory `/home/rsmith/nss-3.10/mozilla/security/nss/cmd/tstclnt'
make[2]: Nothing to be done for `export'.
make[2]: Leaving directory `/home/rsmith/nss-3.10/mozilla/security/nss/cmd/tstclnt'
cd vfychain; make export
make[2]: Entering directory `/home/rsmith/nss-3.10/mozilla/security/nss/cmd/vfychain'
make[2]: Nothing to be done for `export'.
make[2]: Leaving directory `/home/rsmith/nss-3.10/mozilla/security/nss/cmd/vfychain'
cd vfyserv; make export
make[2]: Entering directory `/home/rsmith/nss-3.10/mozilla/security/nss/cmd/vfyserv'
make[2]: Nothing to be done for `export'.
make[2]: Leaving directory `/home/rsmith/nss-3.10/mozilla/security/nss/cmd/vfyserv'
cd modutil; make export
make[2]: Entering directory `/home/rsmith/nss-3.10/mozilla/security/nss/cmd/modutil'
make[2]: Nothing to be done for `export'.
make[2]: Leaving directory `/home/rsmith/nss-3.10/mozilla/security/nss/cmd/modutil'
make[1]: Leaving directory `/home/rsmith/nss-3.10/mozilla/security/nss/cmd'
cd lib; make libs
make[1]: Entering directory `/home/rsmith/nss-3.10/mozilla/security/nss/lib'
cd util; make libs
make[2]: Entering directory `/home/rsmith/nss-3.10/mozilla/security/nss/lib/util'
gcc -o Linux2.6_x86_glibc_PTH_DBG.OBJ/quickder.o -c -g -fPIC -DLINUX1_2 -Di386 -D_XOPEN_SOURCE -DLINUX2_1 -ansi -Wall -pipe -DLINUX -Dlinux -D_POSIX_SOURCE -D_BSD_SOURCE -DHAVE_STRERROR -DXP_UNIX -DDEBUG -UNDEBUG -DDEBUG_rsmith -D_REENTRANT -I../../../../dist/Linux2.6_x86_glibc_PTH_DBG.OBJ/include  -I../../../../dist/public/nss -I../../../../dist/private/nss -I../../../../dist/public/dbm  quickder.c
In file included from quickder.c:43:
secasn1.h:48:21: plarena.h: No such file or directory
In file included from secasn1.h:50,
                 from quickder.c:43:
seccomon.h:50:21: prtypes.h: No such file or directory
In file included from seccomon.h:61,
                 from secasn1.h:50,
                 from quickder.c:43:
secport.h:115:21: prtypes.h: No such file or directory
secport.h:116:44: prlog.h: No such file or directory
secport.h:117:21: plarena.h: No such file or directory
secport.h:118:19: plstr.h: No such file or directory
In file included from seccomon.h:61,
                 from secasn1.h:50,
                 from quickder.c:43:
secport.h:142: error: syntax error before '*' token
secport.h:142: warning: type defaults to `int' in declaration of `PORT_NewArena'
secport.h:142: warning: data definition has no type or storage class
secport.h:143: error: syntax error before '*' token
secport.h:144: error: syntax error before '*' token
secport.h:145: error: syntax error before '*' token
secport.h:146: error: syntax error before '*' token
secport.h:148: error: syntax error before '*' token
secport.h:149: error: syntax error before '*' token
secport.h:150: error: syntax error before '*' token
secport.h:151: error: syntax error before '*' token
secport.h:203: error: syntax error before '*' token
secport.h:203: error: syntax error before "toUnicode"
secport.h:206: warning: type defaults to `int' in declaration of `PRBool'
secport.h:206: error: `PRBool' declared as function returning a function
secport.h:208: error: syntax error before '*' token
secport.h:217: error: syntax error before "convFunc"
secport.h:218: error: syntax error before "convFunc"
secport.h:221: error: `PORT_UCS4_UTF8Conversion' declared as function returning a function
secport.h:225: error: `PORT_UCS2_ASCIIConversion' declared as function returning a function
secport.h:226: error: syntax error before "convFunc"
secport.h:229: error: `PORT_UCS2_UTF8Conversion' declared as function returning a function
secport.h:234: error: `PORT_ISO88591_UTF8Conversion' declared as function returning a function
secport.h:237: error: syntax error before "sec_port_ucs4_utf8_conversion_function"
secport.h:245: warning: type defaults to `int' in declaration of `sec_port_ucs4_utf8_conversion_function'
secport.h:245: warning: data definition has no type or storage class
secport.h:248: error: syntax error before "sec_port_ucs2_utf8_conversion_function"
secport.h:256: warning: type defaults to `int' in declaration of `sec_port_ucs2_utf8_conversion_function'
secport.h:256: warning: data definition has no type or storage class
secport.h:267: error: `sec_port_iso88591_utf8_conversion_function' declared as function returning a function
In file included from quickder.c:43:
secasn1.h:65: error: syntax error before '*' token
secasn1.h:91: error: syntax error before '*' token
secasn1.h:95: error: syntax error before '*' token
secasn1.h:99: error: syntax error before '*' token
secasn1.h:144: error: syntax error before '*' token
secasn1.h:147: error: syntax error before '*' token
secasn1.h:150: error: syntax error before '*' token
secasn1.h:189: error: `SEC_ASN1IsTemplateSimple' declared as function returning a function
In file included from quickder.c:44:
secitem.h:46:21: plarena.h: No such file or directory
secitem.h:47:20: plhash.h: No such file or directory
In file included from quickder.c:44:
secitem.h:63: error: syntax error before '*' token
secitem.h:74: error: syntax error before '*' token
secitem.h:85: error: `SECITEM_ItemsAreEqual' declared as function returning a function
secitem.h:90: error: syntax error before '*' token
secitem.h:103: error: syntax error before '*' token
secitem.h:115: error: syntax error before "PR_CALLBACK"
secitem.h:115: warning: type defaults to `int' in declaration of `SECITEM_Hash'
secitem.h:115: warning: data definition has no type or storage class
secitem.h:117: error: syntax error before "PR_CALLBACK"
secitem.h:117: warning: type defaults to `int' in declaration of `SECITEM_HashCompare'
secitem.h:117: warning: data definition has no type or storage class
quickder.c: In function `MatchComponentType':
quickder.c:150: error: `PR_FALSE' undeclared (first use in this function)
quickder.c:150: error: (Each undeclared identifier is reported only once
quickder.c:150: error: for each function it appears in.)
quickder.c:170: error: `PR_TRUE' undeclared (first use in this function)
quickder.c: In function `CheckSequenceTemplate':
quickder.c:328: error: function `foundAmbiguity' is initialized like a variable
quickder.c:328: error: `PR_FALSE' undeclared (first use in this function)
quickder.c:343: error: `PR_TRUE' undeclared (first use in this function)
quickder.c: At top level:
quickder.c:371: error: syntax error before "PRArenaPool"
quickder.c:375: error: syntax error before "PRArenaPool"
quickder.c: In function `DecodeSequence':
quickder.c:380: error: `templateEntry' undeclared (first use in this function)
quickder.c:389: error: `src' undeclared (first use in this function)
quickder.c:394: error: `PR_FALSE' undeclared (first use in this function)
quickder.c:405: error: `dest' undeclared (first use in this function)
quickder.c:405: error: `arena' undeclared (first use in this function)
quickder.c:405: error: `PR_TRUE' undeclared (first use in this function)
quickder.c: At top level:
quickder.c:427: error: syntax error before "PRArenaPool"
quickder.c: In function `DecodeInline':
quickder.c:430: error: `templateEntry' undeclared (first use in this function)
quickder.c:430: error: `dest' undeclared (first use in this function)
quickder.c:430: error: `PR_FALSE' undeclared (first use in this function)
quickder.c:432: error: `src' undeclared (first use in this function)
quickder.c:432: error: `arena' undeclared (first use in this function)
quickder.c:432: error: `checkTag' undeclared (first use in this function)
quickder.c: At top level:
quickder.c:437: error: syntax error before "PRArenaPool"
quickder.c: In function `DecodePointer':
quickder.c:440: error: `templateEntry' undeclared (first use in this function)
quickder.c:440: error: `dest' undeclared (first use in this function)
quickder.c:440: error: `PR_FALSE' undeclared (first use in this function)
quickder.c:441: error: `arena' undeclared (first use in this function)
quickder.c:445: error: `src' undeclared (first use in this function)
quickder.c:445: error: `checkTag' undeclared (first use in this function)
quickder.c: At top level:
quickder.c:456: error: syntax error before "PRArenaPool"
quickder.c: In function `DecodeImplicit':
quickder.c:458: error: `templateEntry' undeclared (first use in this function)
quickder.c:460: error: `dest' undeclared (first use in this function)
quickder.c:461: error: `src' undeclared (first use in this function)
quickder.c:461: error: `arena' undeclared (first use in this function)
quickder.c:461: error: `PR_FALSE' undeclared (first use in this function)
quickder.c: At top level:
quickder.c:472: error: syntax error before "PRArenaPool"
quickder.c: In function `DecodeChoice':
quickder.c:476: error: `templateEntry' undeclared (first use in this function)
quickder.c:488: error: `src' undeclared (first use in this function)
quickder.c:492: error: `dest' undeclared (first use in this function)
quickder.c:492: error: `arena' undeclared (first use in this function)
quickder.c:492: error: `PR_TRUE' undeclared (first use in this function)
quickder.c: At top level:
quickder.c:521: error: syntax error before "PRArenaPool"
quickder.c: In function `DecodeGroup':
quickder.c:526: error: `PRUint32' undeclared (first use in this function)
quickder.c:526: error: syntax error before "totalEntries"
quickder.c:531: error: `templateEntry' undeclared (first use in this function)
quickder.c:531: error: `dest' undeclared (first use in this function)
quickder.c:531: error: `PR_FALSE' undeclared (first use in this function)
quickder.c:533: error: `src' undeclared (first use in this function)
quickder.c:552: error: `PR_TRUE' undeclared (first use in this function)
quickder.c:555: error: `totalEntries' undeclared (first use in this function)
quickder.c:563: error: `arena' undeclared (first use in this function)
quickder.c:580: error: syntax error before "entriesIndex"
quickder.c:581: error: `entriesIndex' undeclared (first use in this function)
quickder.c:593: error: `entryIndex' undeclared (first use in this function)
quickder.c: At top level:
quickder.c:609: error: syntax error before "PRArenaPool"
quickder.c: In function `DecodeExplicit':
quickder.c:613: error: `src' undeclared (first use in this function)
quickder.c:615: error: `PR_FALSE' undeclared (first use in this function)
quickder.c:619: error: `templateEntry' undeclared (first use in this function)
quickder.c:621: error: `dest' undeclared (first use in this function)
quickder.c:621: error: `arena' undeclared (first use in this function)
quickder.c:621: error: `PR_TRUE' undeclared (first use in this function)
quickder.c: At top level:
quickder.c:636: error: syntax error before "PRArenaPool"
quickder.c: In function `DecodeItem':
quickder.c:641: error: function `pop' is initialized like a variable
quickder.c:641: error: `PR_FALSE' undeclared (first use in this function)
quickder.c:642: error: function `decode' is initialized like a variable
quickder.c:642: error: `PR_TRUE' undeclared (first use in this function)
quickder.c:643: error: function `save' is initialized like a variable
quickder.c:645: error: function `match' is initialized like a variable
quickder.c:646: error: function `optional' is initialized like a variable
quickder.c:648: warning: implicit declaration of function `PR_ASSERT'
quickder.c:648: error: `src' undeclared (first use in this function)
quickder.c:648: error: `dest' undeclared (first use in this function)
quickder.c:648: error: `templateEntry' undeclared (first use in this function)
quickder.c:648: error: `arena' undeclared (first use in this function)
quickder.c:661: error: invalid lvalue in assignment
quickder.c:681: error: function `dontassert' is initialized like a variable
quickder.c:720: error: `checkTag' undeclared (first use in this function)
quickder.c: At top level:
quickder.c:884: error: syntax error before '*' token
quickder.c: In function `SEC_QuickDERDecodeItem':
quickder.c:891: error: `arena' undeclared (first use in this function)
quickder.c:891: error: `templateEntry' undeclared (first use in this function)
quickder.c:891: error: `src' undeclared (first use in this function)
quickder.c:900: error: `dest' undeclared (first use in this function)
quickder.c:900: error: `PR_TRUE' undeclared (first use in this function)
make[2]: *** [Linux2.6_x86_glibc_PTH_DBG.OBJ/quickder.o] Error 1
make[2]: Leaving directory `/home/rsmith/nss-3.10/mozilla/security/nss/lib/util'
make[1]: *** [libs] Error 2
make[1]: Leaving directory `/home/rsmith/nss-3.10/mozilla/security/nss/lib'
make: *** [libs] Error 2
[rsmith@rsmith]:~/nss-3.10/mozilla/security/nss$