All pastes #196714 Raw Edit

Something

public text v1 · immutable
·published 2006-10-10 20:43 UTC
rendered paste body
then mv -f ".deps/btgui-initwindow.Tpo" ".deps/btgui-initwindow.Po"; else rm -f ".deps/btgui-initwindow.Tpo"; exit 1; fi
In file included from initwindow.cpp:28:
initwindow.h:26:26: error: gtkmm/dialog.h: No such file or directory
initwindow.h:27:25: error: gtkmm/label.h: No such file or directory
initwindow.h:28:31: error: gtkmm/progressbar.h: No such file or directory
initwindow.h:29:23: error: gtkmm/box.h: No such file or directory
initwindow.h:45: error: âGtkâ has not been declared
initwindow.h:45: error: expected `{' before âDialogâ
initwindow.h:45: error: invalid function declaration
initwindow.cpp:37: error: invalid use of undefined type âclass btg::UI::gui::initWindowâ
initwindow.h:45: error: forward declaration of âclass btg::UI::gui::initWindowâ
initwindow.cpp: In constructor âbtg::UI::gui::initWindow::initWindow()â:
initwindow.cpp:38: error: class âbtg::UI::gui::initWindowâ does not have any field named âtitle_labelâ
initwindow.cpp:39: error: class âbtg::UI::gui::initWindowâ does not have any field named âlabelâ
initwindow.cpp:40: error: class âbtg::UI::gui::initWindowâ does not have any field named âprogressbarâ
initwindow.cpp:41: error: class âbtg::UI::gui::initWindowâ does not have any field named âvboxâ
initwindow.cpp:43: error: âtitle_labelâ was not declared in this scope
initwindow.cpp:43: error: âGtkâ has not been declared
initwindow.cpp:43: error: âGtkâ has not been declared
initwindow.cpp:46: error: cannot convert âstd::basic_string<char, std::char_traits<char>, std::allocator<char> >â to âintâ in initialization
initwindow.cpp:48: error: âlabelâ was not declared in this scope
initwindow.cpp:48: error: âGtkâ has not been declared
initwindow.cpp:48: error: âGtkâ has not been declared
initwindow.cpp:49: error: âprogressbarâ was not declared in this scope
initwindow.cpp:49: error: âGtkâ has not been declared
initwindow.cpp:49: error: âGtkâ has not been declared
initwindow.cpp:50: error: âvboxâ was not declared in this scope
initwindow.cpp:50: error: âget_vboxâ was not declared in this scope
initwindow.cpp:54: error: âGtkâ has not been declared
initwindow.cpp:64: error: âGtkâ has not been declared
initwindow.cpp:72: error: âGtkâ has not been declared
initwindow.cpp:73: error: âGtkâ has not been declared
initwindow.cpp:74: error: âGtkâ has not been declared
initwindow.cpp:76: error: âproperty_window_positionâ was not declared in this scope
initwindow.cpp:76: error: âGtkâ has not been declared
initwindow.cpp:77: error: âset_resizableâ was not declared in this scope
initwindow.cpp:78: error: âproperty_destroy_with_parentâ was not declared in this scope
initwindow.cpp:79: error: âset_has_separatorâ was not declared in this scope
initwindow.cpp:81: error: âset_border_widthâ was not declared in this scope
initwindow.cpp:85: error: âset_titleâ was not declared in this scope
initwindow.cpp:86: error: âset_modalâ was not declared in this scope
initwindow.cpp: At global scope:
initwindow.cpp:96: error: invalid use of undefined type âclass btg::UI::gui::initWindowâ
initwindow.h:45: error: forward declaration of âclass btg::UI::gui::initWindowâ
initwindow.cpp: In member function âvoid btg::UI::gui::initWindow::setText(const std::string&)â:
initwindow.cpp:98: error: âlabelâ was not declared in this scope
initwindow.cpp: At global scope:
initwindow.cpp:101: error: invalid use of undefined type âclass btg::UI::gui::initWindowâ
initwindow.h:45: error: forward declaration of âclass btg::UI::gui::initWindowâ
initwindow.cpp:101: error: âINITEVENTâ was not declared in this scope
initwindow.cpp:176: error: expected `}' at end of input
initwindow.cpp:176: error: expected `}' at end of input
initwindow.cpp:176: error: expected `}' at end of input
make[2]: *** [btgui-initwindow.o] Error 1
make[2]: Leaving directory `/root/btg/UI/gui'
make[1]: *** [install-recursive] Error 1
make[1]: Leaving directory `/root/btg/UI'
make: *** [install-recursive] Error 1