All pastes #196448 Raw Edit

Something

public text v1 · immutable
·published 2006-10-10 16:33 UTC
rendered paste body
 i686-gentoo-freebsd6.1-gcc -DHAVE_CONFIG_H -I. -I. -I.. -I/usr/include/python2.4 -I/usr/include/pygtk-2.0 -I/usr/include/glib-2.0 -I/usr/lib/glib-2.0/include -pthread -DORBIT2=1 -I/usr/include/gnome-vfs-2.0 -I/usr/lib/gnome-vfs-2.0/include -I/usr/include/gconf/2 -I/usr/include/orbit-2.0 -I/usr/include/glib-2.0 -I/usr/lib/glib-2.0/include -I/usr/include/pyorbit-2 -march=pentium-m -mtune=pentium-m -mfpmath=sse -msse -msse2 -O2 -frename-registers -finline-limit=5000 -pipe -Wall -std=c9x -fno-strict-aliasing -MT gnomevfs_la-vfsmodule.lo -MD -MP -MF .deps/gnomevfs_la-vfsmodule.Tpo -c vfsmodule.c  -fPIC -DPIC -o .libs/gnomevfs_la-vfsmodule.o                                                                                                                
vfsmodule.c: In function 'pygvfs_mime_action_new':                                                                            
vfsmodule.c:1177: error: 'TC_Bonobo_ServerInfo' undeclared (first use in this function)                                       
vfsmodule.c:1177: error: (Each undeclared identifier is reported only once                                                    
vfsmodule.c:1177: error: for each function it appears in.)                                                                    
vfsmodule.c: In function 'pygvfs_mime_get_default_component':                                                                 
vfsmodule.c:1217: error: 'Bonobo_ServerInfo' undeclared (first use in this function)                                          
vfsmodule.c:1217: error: 'component' undeclared (first use in this function)                                                  
vfsmodule.c:1228: error: 'TC_Bonobo_ServerInfo' undeclared (first use in this function)                                       
vfsmodule.c: In function 'pygvfs_mime_components_list_new':                                                                   
vfsmodule.c:1243: error: 'Bonobo_ServerInfo' undeclared (first use in this function)                                          
vfsmodule.c:1243: error: 'component' undeclared (first use in this function)                                                  
vfsmodule.c:1251: error: expected expression before ')' token                                                                 
gmake[2]: *** [gnomevfs_la-vfsmodule.lo] Error 1                                                                              
gmake[2]: Leaving directory `/usr/local/tmp/portage/gnome-python-2.12.4/work/gnome-python-2.12.4/gnomevfs'                    
gmake[1]: *** [all-recursive] Error 1                                                                                         
gmake[1]: Leaving directory `/usr/local/tmp/portage/gnome-python-2.12.4/work/gnome-python-2.12.4'                             
gmake: *** [all] Error 2                                                                                                      
                                                                                                                              
!!! ERROR: dev-python/gnome-python-2.12.4 failed.