make && make modules_install && cp arch/i386/boot/bzImage /boot/vmlinuz-emission1 && cp .config /boot/config-emission1
scripts/kconfig/conf -s arch/i386/Kconfig
CHK include/linux/version.h
CHK include/linux/utsrelease.h
CC arch/i386/kernel/asm-offsets.s
GEN include/asm-i386/asm-offsets.h
CC init/main.o
CHK include/linux/compile.h
CC init/version.o
CC init/do_mounts.o
CC init/do_mounts_rd.o
CC init/do_mounts_initrd.o
LD init/mounts.o
CC init/initramfs.o
CC init/calibrate.o
LD init/built-in.o
CC arch/i386/kernel/process.o
CC arch/i386/kernel/semaphore.o
CC arch/i386/kernel/signal.o
AS arch/i386/kernel/entry.o
CC arch/i386/kernel/traps.o
CC arch/i386/kernel/irq.o
CC arch/i386/kernel/ptrace.o
CC arch/i386/kernel/time.o
CC arch/i386/kernel/ioport.o
CC arch/i386/kernel/ldt.o
CC arch/i386/kernel/setup.o
CC arch/i386/kernel/i8259.o
CC arch/i386/kernel/sys_i386.o
CC arch/i386/kernel/pci-dma.o
CC arch/i386/kernel/i386_ksyms.o
CC arch/i386/kernel/i387.o
CC arch/i386/kernel/bootflag.o
CC arch/i386/kernel/quirks.o
CC arch/i386/kernel/i8237.o
CC arch/i386/kernel/topology.o
CC arch/i386/kernel/alternative.o
CC arch/i386/kernel/i8253.o
CC arch/i386/kernel/tsc.o
CC arch/i386/kernel/acpi/boot.o
CC arch/i386/kernel/acpi/earlyquirk.o
CC arch/i386/kernel/acpi/cstate.o
CC arch/i386/kernel/acpi/processor.o
LD arch/i386/kernel/acpi/built-in.o
CC arch/i386/kernel/cpu/common.o
CC arch/i386/kernel/cpu/proc.o
CC arch/i386/kernel/cpu/amd.o
CC arch/i386/kernel/cpu/cyrix.o
CC arch/i386/kernel/cpu/centaur.o
CC arch/i386/kernel/cpu/transmeta.o
arch/i386/kernel/cpu/transmeta.c: In function 'init_transmeta':
arch/i386/kernel/cpu/transmeta.c:12: warning: 'cpu_freq' may be used uninitialized in this function
CC arch/i386/kernel/cpu/intel.o
CC arch/i386/kernel/cpu/intel_cacheinfo.o
CC arch/i386/kernel/cpu/rise.o
CC arch/i386/kernel/cpu/nexgen.o
CC arch/i386/kernel/cpu/umc.o
CC arch/i386/kernel/cpu/cpufreq/speedstep-lib.o
CC arch/i386/kernel/cpu/cpufreq/p4-clockmod.o
LD arch/i386/kernel/cpu/cpufreq/built-in.o
CC [M] arch/i386/kernel/cpu/cpufreq/acpi-cpufreq.o
CC arch/i386/kernel/cpu/mcheck/mce.o
CC arch/i386/kernel/cpu/mcheck/k7.o
CC arch/i386/kernel/cpu/mcheck/p4.o
CC arch/i386/kernel/cpu/mcheck/p5.o
CC arch/i386/kernel/cpu/mcheck/p6.o
CC arch/i386/kernel/cpu/mcheck/winchip.o
CC arch/i386/kernel/cpu/mcheck/non-fatal.o
LD arch/i386/kernel/cpu/mcheck/built-in.o
CC arch/i386/kernel/cpu/mtrr/main.o
CC arch/i386/kernel/cpu/mtrr/if.o
CC arch/i386/kernel/cpu/mtrr/generic.o
CC arch/i386/kernel/cpu/mtrr/state.o
CC arch/i386/kernel/cpu/mtrr/amd.o
CC arch/i386/kernel/cpu/mtrr/cyrix.o
CC arch/i386/kernel/cpu/mtrr/centaur.o
LD arch/i386/kernel/cpu/mtrr/built-in.o
LD arch/i386/kernel/cpu/built-in.o
CC arch/i386/kernel/reboot.o
CC arch/i386/kernel/msr.o
CC arch/i386/kernel/cpuid.o
CC arch/i386/kernel/smp.o
CC arch/i386/kernel/smpboot.o
AS arch/i386/kernel/trampoline.o
CC arch/i386/kernel/mpparse.o
arch/i386/kernel/mpparse.c: In function 'MP_bus_info':
arch/i386/kernel/mpparse.c:231: warning: comparison is always false due to limited range of data type
CC arch/i386/kernel/apic.o
CC arch/i386/kernel/nmi.o
CC arch/i386/kernel/io_apic.o
CC arch/i386/kernel/module.o
CC arch/i386/kernel/sysenter.o
LDS arch/i386/kernel/vsyscall.lds
AS arch/i386/kernel/vsyscall-int80.o
SYSCALL arch/i386/kernel/vsyscall-int80.so
AS arch/i386/kernel/vsyscall-sysenter.o
SYSCALL arch/i386/kernel/vsyscall-sysenter.so
AS arch/i386/kernel/vsyscall.o
CC arch/i386/kernel/time_hpet.o
CC arch/i386/kernel/doublefault.o
CC arch/i386/kernel/vm86.o
CC arch/i386/kernel/early_printk.o
CC arch/i386/kernel/hpet.o
SYSCALL arch/i386/kernel/vsyscall-syms.o
LD arch/i386/kernel/built-in.o
AS arch/i386/kernel/head.o
CC arch/i386/kernel/init_task.o
LDS arch/i386/kernel/vmlinux.lds
CC arch/i386/mm/init.o
arch/i386/mm/init.c: In function 'set_highmem_pages_init':
arch/i386/mm/init.c:326: error: too many arguments to function 'add_one_highpage_init'
make[1]: *** [arch/i386/mm/init.o] Error 1
make: *** [arch/i386/mm] Error 2