All pastes #191607 Raw Edit

drbombay43

public text v1 · immutable
·published 2006-10-05 03:39 UTC
rendered paste body
o-exceptions -fno-check-new -fno-common -DQT_CLEAN_NAMESPACE -DQT_NO_ASCII_CAST -DQT_NO_STL -DQT_NO_COMPAT -DQT_NO_TRANSLATION  -c -o ipodmed
iadevice.lo ipodmediadevice.cpp
ipodmediadevice.cpp: In member function 'QString IpodMediaDevice::realPath(const char*)':
ipodmediadevice.cpp:1452: error: 'struct _Itdb_iTunesDB' has no member named 'mountpoint'
ipodmediadevice.cpp: In member function 'QString IpodMediaDevice::ipodPath(const QString&)':
ipodmediadevice.cpp:1464: error: 'struct _Itdb_iTunesDB' has no member named 'mountpoint'
make[5]: *** [ipodmediadevice.lo] Error 1
make[5]: Leaving directory `/var/tmp/portage/amarok-1.4.3-r1/work/amarok-1.4.3/amarok/src/mediadevice/ipod'
make[4]: *** [all-recursive] Error 1
make[4]: Leaving directory `/var/tmp/portage/amarok-1.4.3-r1/work/amarok-1.4.3/amarok/src/mediadevice'
make[3]: *** [all-recursive] Error 1
make[3]: Leaving directory `/var/tmp/portage/amarok-1.4.3-r1/work/amarok-1.4.3/amarok/src'
make[2]: *** [all-recursive] Error 1
make[2]: Leaving directory `/var/tmp/portage/amarok-1.4.3-r1/work/amarok-1.4.3/amarok'
make[1]: *** [all-recursive] Error 1
make[1]: Leaving directory `/var/tmp/portage/amarok-1.4.3-r1/work/amarok-1.4.3'
make: *** [all] Error 2

!!! ERROR: media-sound/amarok-1.4.3-r1 failed.
Call stack:
  ebuild.sh, line 1546:   Called dyn_compile
  ebuild.sh, line 937:   Called src_compile
  amarok-1.4.3-r1.ebuild, line 75:   Called kde_src_compile
  kde.eclass, line 164:   Called kde_src_compile 'all'
  kde.eclass, line 331:   Called kde_src_compile 'myconf' 'configure' 'make'
  kde.eclass, line 327:   Called die

!!! died running emake, kde_src_compile:make
!!! If you need support, post the topmost build error, and the call stack if relevant