rendered paste bodyError.h:21: type specifier omitted for parameter `va_list'
Error.h:21: syntax error before `)' token
make[3]: *** [DCTStream.lo] Error 1
make[3]: Leaving directory `/var/tmp/portage/poppler-0.3.3/work/poppler-0.3.3/poppler'
make[2]: *** [all] Error 2
make[2]: Leaving directory `/var/tmp/portage/poppler-0.3.3/work/poppler-0.3.3/poppler'
make[1]: *** [all-recursive] Error 1
make[1]: Leaving directory `/var/tmp/portage/poppler-0.3.3/work/poppler-0.3.3'
make: *** [all] Error 2
!!! ERROR: app-text/poppler-0.3.3 failed.
!!! Function src_compile, Line 28, Exitcode 2
!!! (no error message)
!!! If you need support, post the topmost build error, NOT this status message.