* Compiling twitter_lib.cIn file included from /usr/include/sys/vnode.h:45, from /usr/include/sys/stream.h:22, from /usr/include/netinet/in.h:66, from /usr/include/sys/socket.h:45, from /home/jussi/temp/bitlbee-1.2.8/sock.h:6, from /home/jussi/temp/bitlbee-1.2.8/bitlbee.h:140, from /home/jussi/temp/bitlbee-1.2.8/protocols/nogaim.h:43, from twitter_http.h:27, from twitter_lib.c:27:/usr/include/sys/resource.h:146: error: field `ru_utime' has incomplete type/usr/include/sys/resource.h:147: error: field `ru_stime' has incomplete typetwitter_lib.c: In function `twitter_xt_next_cursor':twitter_lib.c:176: warning: implicit declaration of function `g_ascii_strtoll'twitter_lib.c: In function `twitter_xt_get_status':twitter_lib.c:366: warning: implicit declaration of function `strptime'twitter_lib.c:738:2: warning: no newline at end of filegmake[2]: *** [twitter_lib.o] Error 1