/usr/src/zaptel/zaptel.c:5872: error: invalid use of undefined type `struct zt_chan'
/usr/src/zaptel/zaptel.c:5872: error: dereferencing pointer to incomplete type
/usr/src/zaptel/zaptel.c:5874: error: invalid use of undefined type `struct zt_chan'
/usr/src/zaptel/zaptel.c:5874: error: dereferencing pointer to incomplete type
/usr/src/zaptel/zaptel.c:5878: error: invalid use of undefined type `struct zt_chan'
/usr/src/zaptel/zaptel.c:5878: error: dereferencing pointer to incomplete type
/usr/src/zaptel/zaptel.c:5893: error: dereferencing pointer to incomplete type
/usr/src/zaptel/zaptel.c:5893: error: dereferencing pointer to incomplete type
/usr/src/zaptel/zaptel.c:5895: error: dereferencing pointer to incomplete type
/usr/src/zaptel/zaptel.c:5896: error: dereferencing pointer to incomplete type
/usr/src/zaptel/zaptel.c:5899: error: dereferencing pointer to incomplete type
/usr/src/zaptel/zaptel.c:5900: error: dereferencing pointer to incomplete type
/usr/src/zaptel/zaptel.c:5907: error: dereferencing pointer to incomplete type
/usr/src/zaptel/zaptel.c:5908: error: dereferencing pointer to incomplete type
/usr/src/zaptel/zaptel.c:5910: error: dereferencing pointer to incomplete type
/usr/src/zaptel/zaptel.c:5931: error: dereferencing pointer to incomplete type
/usr/src/zaptel/zaptel.c:5933: error: dereferencing pointer to incomplete type
/usr/src/zaptel/zaptel.c:5936: error: dereferencing pointer to incomplete type
/usr/src/zaptel/zaptel.c:5940: error: dereferencing pointer to incomplete type
/usr/src/zaptel/zaptel.c:5940: error: dereferencing pointer to incomplete type
/usr/src/zaptel/zaptel.c:5942: error: dereferencing pointer to incomplete type
/usr/src/zaptel/zaptel.c:5943: error: dereferencing pointer to incomplete type
/usr/src/zaptel/zaptel.c:5946: error: dereferencing pointer to incomplete type
/usr/src/zaptel/zaptel.c:5947: error: dereferencing pointer to incomplete type
/usr/src/zaptel/zaptel.c: At top level:
/usr/src/zaptel/zaptel.c:5964: error: variable `zt_fops' has initializer but incomplete type
/usr/src/zaptel/zaptel.c:5965: error: unknown field `owner' specified in initializer
/usr/src/zaptel/zaptel.c:5965: warning: excess elements in struct initializer
/usr/src/zaptel/zaptel.c:5965: warning: (near initialization for `zt_fops')
/usr/src/zaptel/zaptel.c:5966: error: unknown field `llseek' specified in initializer
/usr/src/zaptel/zaptel.c:5966: warning: excess elements in struct initializer
/usr/src/zaptel/zaptel.c:5966: warning: (near initialization for `zt_fops')
/usr/src/zaptel/zaptel.c:5967: error: unknown field `open' specified in initializer
/usr/src/zaptel/zaptel.c:5967: warning: excess elements in struct initializer
/usr/src/zaptel/zaptel.c:5967: warning: (near initialization for `zt_fops')
/usr/src/zaptel/zaptel.c:5968: error: unknown field `release' specified in initializer
/usr/src/zaptel/zaptel.c:5968: warning: excess elements in struct initializer
/usr/src/zaptel/zaptel.c:5968: warning: (near initialization for `zt_fops')
/usr/src/zaptel/zaptel.c:5969: error: unknown field `ioctl' specified in initializer
/usr/src/zaptel/zaptel.c:5969: warning: excess elements in struct initializer
/usr/src/zaptel/zaptel.c:5969: warning: (near initialization for `zt_fops')
/usr/src/zaptel/zaptel.c:5970: error: unknown field `read' specified in initializer
/usr/src/zaptel/zaptel.c:5970: warning: excess elements in struct initializer
/usr/src/zaptel/zaptel.c:5970: warning: (near initialization for `zt_fops')
/usr/src/zaptel/zaptel.c:5971: error: unknown field `write' specified in initializer
/usr/src/zaptel/zaptel.c:5971: warning: excess elements in struct initializer
/usr/src/zaptel/zaptel.c:5971: warning: (near initialization for `zt_fops')
/usr/src/zaptel/zaptel.c:5972: error: unknown field `poll' specified in initializer
/usr/src/zaptel/zaptel.c:5972: warning: excess elements in struct initializer
/usr/src/zaptel/zaptel.c:5972: warning: (near initialization for `zt_fops')
/usr/src/zaptel/zaptel.c:5973: error: unknown field `mmap' specified in initializer
/usr/src/zaptel/zaptel.c:5973: warning: excess elements in struct initializer
/usr/src/zaptel/zaptel.c:5973: warning: (near initialization for `zt_fops')
/usr/src/zaptel/zaptel.c:5974: error: unknown field `flush' specified in initializer
/usr/src/zaptel/zaptel.c:5974: warning: excess elements in struct initializer
/usr/src/zaptel/zaptel.c:5974: warning: (near initialization for `zt_fops')
/usr/src/zaptel/zaptel.c:5975: error: unknown field `fsync' specified in initializer
/usr/src/zaptel/zaptel.c:5975: warning: excess elements in struct initializer
/usr/src/zaptel/zaptel.c:5975: warning: (near initialization for `zt_fops')
/usr/src/zaptel/zaptel.c:5976: error: unknown field `fasync' specified in initializer
/usr/src/zaptel/zaptel.c:5976: warning: excess elements in struct initializer
/usr/src/zaptel/zaptel.c:5976: warning: (near initialization for `zt_fops')
/usr/src/zaptel/zaptel.c: In function `zt_prechan_ioctl':
/usr/src/zaptel/zaptel.c:4029: warning: unreachable code at beginning of switch statement
/usr/src/zaptel/zaptel.c: At top level:
include/linux/elf.h:429: warning: array `_DYNAMIC' assumed to have one element
include/linux/sched.h:205: error: storage size of `mmap_sem' isn't known
include/linux/sched.h:239: error: storage size of `default_kioctx' isn't known
include/linux/sched.h:264: error: storage size of `shared_pending' isn't known
include/linux/sched.h:459: error: storage size of `rlim' isn't known
include/linux/sched.h:467: error: storage size of `thread' isn't known
include/linux/sched.h:479: error: storage size of `pending' isn't known
include/linux/stat.h:68: error: storage size of `atime' isn't known
include/linux/stat.h:69: error: storage size of `mtime' isn't known
include/linux/stat.h:70: error: storage size of `ctime' isn't known
include/linux/fs.h:268: error: storage size of `ia_atime' isn't known
include/linux/fs.h:269: error: storage size of `ia_mtime' isn't known
include/linux/fs.h:270: error: storage size of `ia_ctime' isn't known
include/linux/quota.h:224: error: storage size of `dq_dqb' isn't known
include/linux/fs.h:347: error: storage size of `bd_sem' isn't known
include/linux/fs.h:348: error: storage size of `bd_mount_sem' isn't known
include/linux/fs.h:420: error: storage size of `i_atime' isn't known
include/linux/fs.h:421: error: storage size of `i_mtime' isn't known
include/linux/fs.h:422: error: storage size of `i_ctime' isn't known
include/linux/fs.h:429: error: storage size of `i_sem' isn't known
include/linux/fs.h:430: error: storage size of `i_alloc_sem' isn't known
include/linux/fs.h:436: error: storage size of `i_data' isn't known
include/linux/fs.h:562: error: storage size of `f_owner' isn't known
include/linux/fs.h:736: error: storage size of `s_umount' isn't known
include/linux/fs.h:737: error: storage size of `s_lock' isn't known
include/linux/fs.h:764: error: storage size of `s_vfs_rename_sem' isn't known
{standard input}: Assembler messages:
{standard input}:745: Error: symbol `rv' is already defined
{standard input}:759: Error: symbol `rv' is already defined
{standard input}:766: Error: symbol `c' is already defined
{standard input}:772: Error: symbol `rv' is already defined
include/linux/pci.h:471: error: storage size of `dev' isn't known
/usr/src/zaptel/zaptel.c:5964: error: storage size of `zt_fops' isn't known
include/linux/proc_fs.h:210: warning: `create_proc_read_entry' declared `static' but never defined
/usr/src/zaptel/zaptel.c:3537: warning: `recalc_maxlinks' defined but not used
/usr/src/zaptel/zaptel.c:571: warning: `zt_first_empty_conference' defined but not used
/usr/src/zaptel/zaptel.c:582: warning: `zt_get_conf_alias' defined but not used
/usr/src/zaptel/zaptel.c:963: warning: `free_tone_zone' defined but not used
/usr/src/zaptel/zaptel.c:2278: warning: `ioctl_load_zone' defined but not used
/usr/src/zaptel/zaptel.c:2601: warning: `zt_common_ioctl' defined but not used
/usr/src/zaptel/zaptel.c:2846: warning: `recalc_slaves' defined but not used
{standard input}:5414: Error: symbol `default_zone' is already defined
{standard input}:5426: Error: symbol `rv' is already defined
{standard input}:5432: Error: symbol `rv' is already defined
{standard input}:5438: Error: symbol `rv' is already defined
{standard input}:5444: Error: symbol `i' is already defined
{standard input}:5450: Error: symbol `rv' is already defined
{standard input}:5456: Error: symbol `rv' is already defined
{standard input}:5468: Error: symbol `rv' is already defined
{standard input}:5474: Error: symbol `rv' is already defined
{standard input}:5480: Error: symbol `i' is already defined
{standard input}:5486: Error: symbol `i' is already defined
{standard input}:5492: Error: symbol `j' is already defined
make[2]: *** [/usr/src/zaptel/zaptel.o] Error 1
make[1]: *** [/usr/src/zaptel] Error 2
make[1]: Leaving directory `/usr/src/linux-2.6.5-1.358'
make: *** [linux26] Error 2