rendered paste body/var/tmp/portage/alsa-driver-1.0.11/work/alsa-driver-1.0.11/isa/msnd/msnd_pinnacle.c:1539: error: expected ')' before string constant
/var/tmp/portage/alsa-driver-1.0.11/work/alsa-driver-1.0.11/isa/msnd/msnd_pinnacle.c:1540: error: expected ')' before string constant
/var/tmp/portage/alsa-driver-1.0.11/work/alsa-driver-1.0.11/isa/msnd/msnd_pinnacle.c:1541: error: expected ')' before string constant
/var/tmp/portage/alsa-driver-1.0.11/work/alsa-driver-1.0.11/isa/msnd/msnd_pinnacle.c:1542: error: expected ')' before string constant
/var/tmp/portage/alsa-driver-1.0.11/work/alsa-driver-1.0.11/isa/msnd/msnd_pinnacle.c:1543: error: expected ')' before string constant
/var/tmp/portage/alsa-driver-1.0.11/work/alsa-driver-1.0.11/isa/msnd/msnd_pinnacle.c:1545: error: expected ')' before string constant
/var/tmp/portage/alsa-driver-1.0.11/work/alsa-driver-1.0.11/isa/msnd/msnd_pinnacle.c:1546: error: expected ')' before string constant
/var/tmp/portage/alsa-driver-1.0.11/work/alsa-driver-1.0.11/isa/msnd/msnd_pinnacle.c:1547: error: expected ')' before string constant
/var/tmp/portage/alsa-driver-1.0.11/work/alsa-driver-1.0.11/isa/msnd/msnd_pinnacle.c:1548: error: expected ')' before string constant
/var/tmp/portage/alsa-driver-1.0.11/work/alsa-driver-1.0.11/isa/msnd/msnd_pinnacle.c:1549: error: expected ')' before string constant
/var/tmp/portage/alsa-driver-1.0.11/work/alsa-driver-1.0.11/isa/msnd/msnd_pinnacle.c:1550: error: expected ')' before string constant
/var/tmp/portage/alsa-driver-1.0.11/work/alsa-driver-1.0.11/isa/msnd/msnd_pinnacle.c:1551: error: expected ')' before string constant
/var/tmp/portage/alsa-driver-1.0.11/work/alsa-driver-1.0.11/isa/msnd/msnd_pinnacle.c:1552: error: expected ')' before string constant
/var/tmp/portage/alsa-driver-1.0.11/work/alsa-driver-1.0.11/isa/msnd/msnd_pinnacle.c:1553: error: expected ')' before string constant
make[5]: *** [/var/tmp/portage/alsa-driver-1.0.11/work/alsa-driver-1.0.11/isa/msnd/msnd_pinnacle.o] Error 1
make[4]: *** [/var/tmp/portage/alsa-driver-1.0.11/work/alsa-driver-1.0.11/isa/msnd] Error 2
make[3]: *** [/var/tmp/portage/alsa-driver-1.0.11/work/alsa-driver-1.0.11/isa] Error 2
make[2]: *** [_module_/var/tmp/portage/alsa-driver-1.0.11/work/alsa-driver-1.0.11] Error 2
make[1]: *** [modules] Error 2
make[1]: Leaving directory `/usr/src/linux-2.6.17-gentoo-r8'
make: *** [compile] Error 2
!!! ERROR: media-sound/alsa-driver-1.0.11 failed.
Call stack:
ebuild.sh, line 1546: Called dyn_compile
ebuild.sh, line 937: Called src_compile
alsa-driver-1.0.11.ebuild, line 109: Called die
!!! Make Failed
!!! If you need support, post the topmost build error, and the call stack if relevant.