rendered paste bodyranlib .libs/libecore_dbus.a
creating libecore_dbus.la
(cd .libs && rm -f libecore_dbus.la && ln -s ../libecore_dbus.la libecore_dbus.la)
make[4]: Leaving directory `/home/morphir/e17_cvs/e17/libs/ecore/src/lib/ecore_dbus'
make[4]: Entering directory `/home/morphir/e17_cvs/e17/libs/ecore/src/lib'
make[4]: Nothing to be done for `all-am'.
make[4]: Leaving directory `/home/morphir/e17_cvs/e17/libs/ecore/src/lib'
make[3]: Leaving directory `/home/morphir/e17_cvs/e17/libs/ecore/src/lib'
Making all in bin
make[3]: Entering directory `/home/morphir/e17_cvs/e17/libs/ecore/src/bin'
if gcc -DHAVE_CONFIG_H -I. -I. -I../.. -I../../src/lib/ecore -I../../src/lib/ecore_evas -I../../src/lib/ecore_directfb -I../../src/lib/ecore_x -I../../src/lib/ecore_fb -I../../src/lib/ecore_job -I../../src/lib/ecore_con -I../../src/lib/ecore_ipc -I../../src/lib/ecore_txt -I../../src/lib/ecore_config -I../../src/lib/ecore_dbus -I../../src/lib/ecore -I../../src/lib/ecore_evas -I../../src/lib/ecore_directfb -I../../src/lib/ecore_x -I../../src/lib/ecore_fb -I../../src/lib/ecore_job -I../../src/lib/ecore_con -I../../src/lib/ecore_ipc -I../../src/lib/ecore_txt -I../../src/lib/ecore_config -I../../src/lib/ecore_dbus -I/usr/local/include -I/usr/X11R6/include -I/usr/local/include -DPACKAGE_BIN_DIR=\"/opt/e17/bin\" -DPACKAGE_LIB_DIR=\"/opt/e17/lib\" -DPACKAGE_DATA_DIR=\"/opt/e17/share/ecore\" -I/opt/e17/include -I/usr/local/include -g -O2 -Wall -I../../src/lib/ecore -I../../src/lib/ecore_evas -I../../src/lib/ecore_directfb -I../../src/lib/ecore_x -I../../src/lib/ecore_fb -I../../src/lib/ecore_job -I../../src/lib/ecore_con -I../../src/lib/ecore_ipc -I../../src/lib/ecore_txt -I../../src/lib/ecore_config -I../../src/lib/ecore_dbus -I../../src/lib/ecore -I../../src/lib/ecore_evas -I../../src/lib/ecore_directfb -I../../src/lib/ecore_x -I../../src/lib/ecore_fb -I../../src/lib/ecore_job -I../../src/lib/ecore_con -I../../src/lib/ecore_ipc -I../../src/lib/ecore_txt -I../../src/lib/ecore_config -I../../src/lib/ecore_dbus -I/usr/local/include -I/usr/X11R6/include -I/usr/local/include -DPACKAGE_BIN_DIR=\"/opt/e17/bin\" -DPACKAGE_LIB_DIR=\"/opt/e17/lib\" -DPACKAGE_DATA_DIR=\"/opt/e17/share/ecore\" -I/usr/local/include -g -O2 -Wall -MT ecore_test-ecore_test.o -MD -MP -MF ".deps/ecore_test-ecore_test.Tpo" -c -o ecore_test-ecore_test.o `test -f 'ecore_test.c' || echo './'`ecore_test.c; \
then mv -f ".deps/ecore_test-ecore_test.Tpo" ".deps/ecore_test-ecore_test.Po"; else rm -f ".deps/ecore_test-ecore_test.Tpo"; exit 1; fi
/bin/sh ../../libtool --tag=CC --mode=link gcc -I/usr/local/include -g -O2 -Wall -L/opt/e17/lib -o ecore_test ecore_test-ecore_test.o ../../src/lib/ecore/libecore.la ../../src/lib/ecore_x/libecore_x.la ../../src/lib/ecore_txt/libecore_txt.la ../../src/lib/ecore_job/libecore_job.la ../../src/lib/ecore_evas/libecore_evas.la ../../src/lib/ecore_con/libecore_con.la ../../src/lib/ecore_ipc/libecore_ipc.la -lm
mkdir .libs
gcc -I/usr/local/include -g -O2 -Wall -o .libs/ecore_test ecore_test-ecore_test.o -L/opt/e17/lib ../../src/lib/ecore/.libs/libecore.so ../../src/lib/ecore_x/.libs/libecore_x.so ../../src/lib/ecore_txt/.libs/libecore_txt.so ../../src/lib/ecore_job/.libs/libecore_job.so ../../src/lib/ecore_evas/.libs/libecore_evas.so ../../src/lib/ecore_con/.libs/libecore_con.so ../../src/lib/ecore_ipc/.libs/libecore_ipc.so -lm
../../src/lib/ecore_evas/.libs/libecore_evas.so: undefined reference to `evas_data_attach_get'
../../src/lib/ecore_evas/.libs/libecore_evas.so: undefined reference to `evas_data_attach_set'
collect2: ld returned 1 exit status
make[3]: *** [ecore_test] Error 1
make[3]: Leaving directory `/home/morphir/e17_cvs/e17/libs/ecore/src/bin'
make[2]: *** [all-recursive] Error 1
make[2]: Leaving directory `/home/morphir/e17_cvs/e17/libs/ecore/src'
make[1]: *** [all-recursive] Error 1
make[1]: Leaving directory `/home/morphir/e17_cvs/e17/libs/ecore'
make: *** [all] Error 2