hub mythtv # make -j4
cd libs && qmake libs.pro -o Makefile
cd programs && qmake programs.pro -o Makefile
cd themes && qmake themes.pro -o Makefile
cd filters && qmake filters.pro -o Makefile
cd i18n && qmake i18n.pro -o Makefile
cd libs && make -f Makefile
make[1]: Entering directory `/root/myth/mythnew/mythtv/libs'
cd libavutil && qmake libavutil.pro -o Makefile
cd libavcodec && qmake libavcodec.pro -o Makefile
cd libavformat && qmake libavformat.pro -o Makefile
cd libmythsamplerate && qmake libmythsamplerate.pro -o Makefile
cd libmythsoundtouch && qmake libmythsoundtouch.pro -o Makefile
cd libmythmpeg2 && qmake libmythmpeg2.pro -o Makefile
cd libmythdvdnav && qmake libmythdvdnav.pro -o Makefile
cd libmyth && qmake libmyth.pro -o Makefile
cd libmythtv && qmake libmythtv.pro -o Makefile
cd libmythui && qmake libmythui.pro -o Makefile
cd libmythfreemheg && qmake libmythfreemheg.pro -o Makefile
cd libmythupnp && qmake libmythupnp.pro -o Makefile
cd libmythlivemedia && qmake libmythlivemedia.pro -o Makefile
cd libavutil && make -f Makefile
make[2]: Entering directory `/root/myth/mythnew/mythtv/libs/libavutil'
distcc gcc -c -pipe -march=pentium4 -w -O3 -Wall -Wno-switch -fomit-frame-pointer -g -DNDEBUG -O -D_REENTRANT -DMMX -Di386 -DUSING_FREEBOX -D_GNU_SOURCE -D_FILE_OFFSET_BITS=64 -DPREFIX=\"/usr/local\" -DLIBDIR=\"/usr/local/lib\" -DHAVE_AV_CONFIG_H -D_LARGEFILE_SOURCE -I/usr/qt/3/mkspecs/linux-g++ -I. -I.. -I../.. -o adler32.o adler32.c
distcc gcc -c -pipe -march=pentium4 -w -O3 -Wall -Wno-switch -fomit-frame-pointer -g -DNDEBUG -O -D_REENTRANT -DMMX -Di386 -DUSING_FREEBOX -D_GNU_SOURCE -D_FILE_OFFSET_BITS=64 -DPREFIX=\"/usr/local\" -DLIBDIR=\"/usr/local/lib\" -DHAVE_AV_CONFIG_H -D_LARGEFILE_SOURCE -I/usr/qt/3/mkspecs/linux-g++ -I. -I.. -I../.. -o mathematics.o mathematics.c
distcc gcc -c -pipe -march=pentium4 -w -O3 -Wall -Wno-switch -fomit-frame-pointer -g -DNDEBUG -O -D_REENTRANT -DMMX -Di386 -DUSING_FREEBOX -D_GNU_SOURCE -D_FILE_OFFSET_BITS=64 -DPREFIX=\"/usr/local\" -DLIBDIR=\"/usr/local/lib\" -DHAVE_AV_CONFIG_H -D_LARGEFILE_SOURCE -I/usr/qt/3/mkspecs/linux-g++ -I. -I.. -I../.. -o integer.o integer.c
distcc gcc -c -pipe -march=pentium4 -w -O3 -Wall -Wno-switch -fomit-frame-pointer -g -DNDEBUG -O -D_REENTRANT -DMMX -Di386 -DUSING_FREEBOX -D_GNU_SOURCE -D_FILE_OFFSET_BITS=64 -DPREFIX=\"/usr/local\" -DLIBDIR=\"/usr/local/lib\" -DHAVE_AV_CONFIG_H -D_LARGEFILE_SOURCE -I/usr/qt/3/mkspecs/linux-g++ -I. -I.. -I../.. -o lls.o lls.c
distcc gcc -c -pipe -march=pentium4 -w -O3 -Wall -Wno-switch -fomit-frame-pointer -g -DNDEBUG -O -D_REENTRANT -DMMX -Di386 -DUSING_FREEBOX -D_GNU_SOURCE -D_FILE_OFFSET_BITS=64 -DPREFIX=\"/usr/local\" -DLIBDIR=\"/usr/local/lib\" -DHAVE_AV_CONFIG_H -D_LARGEFILE_SOURCE -I/usr/qt/3/mkspecs/linux-g++ -I. -I.. -I../.. -o log.o log.c
distcc gcc -c -pipe -march=pentium4 -w -O3 -Wall -Wno-switch -fomit-frame-pointer -g -DNDEBUG -O -D_REENTRANT -DMMX -Di386 -DUSING_FREEBOX -D_GNU_SOURCE -D_FILE_OFFSET_BITS=64 -DPREFIX=\"/usr/local\" -DLIBDIR=\"/usr/local/lib\" -DHAVE_AV_CONFIG_H -D_LARGEFILE_SOURCE -I/usr/qt/3/mkspecs/linux-g++ -I. -I.. -I../.. -o mem.o mem.c
distcc gcc -c -pipe -march=pentium4 -w -O3 -Wall -Wno-switch -fomit-frame-pointer -g -DNDEBUG -O -D_REENTRANT -DMMX -Di386 -DUSING_FREEBOX -D_GNU_SOURCE -D_FILE_OFFSET_BITS=64 -DPREFIX=\"/usr/local\" -DLIBDIR=\"/usr/local/lib\" -DHAVE_AV_CONFIG_H -D_LARGEFILE_SOURCE -I/usr/qt/3/mkspecs/linux-g++ -I. -I.. -I../.. -o rational.o rational.c
distcc gcc -c -pipe -march=pentium4 -w -O3 -Wall -Wno-switch -fomit-frame-pointer -g -DNDEBUG -O -D_REENTRANT -DMMX -Di386 -DUSING_FREEBOX -D_GNU_SOURCE -D_FILE_OFFSET_BITS=64 -DPREFIX=\"/usr/local\" -DLIBDIR=\"/usr/local/lib\" -DHAVE_AV_CONFIG_H -D_LARGEFILE_SOURCE -I/usr/qt/3/mkspecs/linux-g++ -I. -I.. -I../.. -o intfloat_readwrite.o intfloat_readwrite.c
distcc gcc -c -pipe -march=pentium4 -w -O3 -Wall -Wno-switch -fomit-frame-pointer -g -DNDEBUG -O -D_REENTRANT -DMMX -Di386 -DUSING_FREEBOX -D_GNU_SOURCE -D_FILE_OFFSET_BITS=64 -DPREFIX=\"/usr/local\" -DLIBDIR=\"/usr/local/lib\" -DHAVE_AV_CONFIG_H -D_LARGEFILE_SOURCE -I/usr/qt/3/mkspecs/linux-g++ -I. -I.. -I../.. -o crc.o crc.c
distcc gcc -c -pipe -march=pentium4 -w -O3 -Wall -Wno-switch -fomit-frame-pointer -g -DNDEBUG -O -D_REENTRANT -DMMX -Di386 -DUSING_FREEBOX -D_GNU_SOURCE -D_FILE_OFFSET_BITS=64 -DPREFIX=\"/usr/local\" -DLIBDIR=\"/usr/local/lib\" -DHAVE_AV_CONFIG_H -D_LARGEFILE_SOURCE -I/usr/qt/3/mkspecs/linux-g++ -I. -I.. -I../.. -o md5.o md5.c
distcc gcc -c -pipe -march=pentium4 -w -O3 -Wall -Wno-switch -fomit-frame-pointer -g -DNDEBUG -O -D_REENTRANT -DMMX -Di386 -DUSING_FREEBOX -D_GNU_SOURCE -D_FILE_OFFSET_BITS=64 -DPREFIX=\"/usr/local\" -DLIBDIR=\"/usr/local/lib\" -DHAVE_AV_CONFIG_H -D_LARGEFILE_SOURCE -I/usr/qt/3/mkspecs/linux-g++ -I. -I.. -I../.. -o fifo.o fifo.c
rm -f libmythavutil-0.20.so.0.20.0 libmythavutil-0.20.so libmythavutil-0.20.so.0 libmythavutil-0.20.so.0.20
distcc g++ -shared -Wl,-soname,libmythavutil-0.20.so.0 -o libmythavutil-0.20.so.0.20.0 adler32.o mathematics.o integer.o lls.o log.o mem.o rational.o intfloat_readwrite.o crc.o md5.o fifo.o -lpthread
/usr/lib/gcc/i686-pc-linux-gnu/4.1.1/../../../../i686-pc-linux-gnu/bin/ld: warning: creating a DT_TEXTREL in object.
ln -s libmythavutil-0.20.so.0.20.0 libmythavutil-0.20.so
ln -s libmythavutil-0.20.so.0.20.0 libmythavutil-0.20.so.0
ln -s libmythavutil-0.20.so.0.20.0 libmythavutil-0.20.so.0.20
make[2]: Leaving directory `/root/myth/mythnew/mythtv/libs/libavutil'
cd libavcodec && make -f Makefile
make[2]: Entering directory `/root/myth/mythnew/mythtv/libs/libavcodec'
distcc gcc -c -pipe -march=pentium4 -w -O3 -Wall -Wno-switch -fomit-frame-pointer -g -DNDEBUG -O -D_REENTRANT -DMMX -Di386 -DUSING_FREEBOX -D_GNU_SOURCE -D_FILE_OFFSET_BITS=64 -DPREFIX=\"/usr/local\" -DLIBDIR=\"/usr/local/lib\" -DHAVE_AV_CONFIG_H -D_LARGEFILE_SOURCE -DQT_THREAD_SUPPORT -DQT_SHARED -DQT_TABLET_SUPPORT -I/usr/qt/3/mkspecs/linux-g++ -I. -I.. -I../.. -I../libavutil -I/usr/qt/3/include -o bitstream.o bitstream.c
distcc gcc -c -pipe -march=pentium4 -w -O3 -Wall -Wno-switch -fomit-frame-pointer -g -DNDEBUG -O -D_REENTRANT -DMMX -Di386 -DUSING_FREEBOX -D_GNU_SOURCE -D_FILE_OFFSET_BITS=64 -DPREFIX=\"/usr/local\" -DLIBDIR=\"/usr/local/lib\" -DHAVE_AV_CONFIG_H -D_LARGEFILE_SOURCE -DQT_THREAD_SUPPORT -DQT_SHARED -DQT_TABLET_SUPPORT -I/usr/qt/3/mkspecs/linux-g++ -I. -I.. -I../.. -I../libavutil -I/usr/qt/3/include -o utils.o utils.c
distcc gcc -c -pipe -march=pentium4 -w -O3 -Wall -Wno-switch -fomit-frame-pointer -g -DNDEBUG -O -D_REENTRANT -DMMX -Di386 -DUSING_FREEBOX -D_GNU_SOURCE -D_FILE_OFFSET_BITS=64 -DPREFIX=\"/usr/local\" -DLIBDIR=\"/usr/local/lib\" -DHAVE_AV_CONFIG_H -D_LARGEFILE_SOURCE -DQT_THREAD_SUPPORT -DQT_SHARED -DQT_TABLET_SUPPORT -I/usr/qt/3/mkspecs/linux-g++ -I. -I.. -I../.. -I../libavutil -I/usr/qt/3/include -o allcodecs.o allcodecs.c
distcc gcc -c -pipe -march=pentium4 -w -O3 -Wall -Wno-switch -fomit-frame-pointer -g -DNDEBUG -O -D_REENTRANT -DMMX -Di386 -DUSING_FREEBOX -D_GNU_SOURCE -D_FILE_OFFSET_BITS=64 -DPREFIX=\"/usr/local\" -DLIBDIR=\"/usr/local/lib\" -DHAVE_AV_CONFIG_H -D_LARGEFILE_SOURCE -DQT_THREAD_SUPPORT -DQT_SHARED -DQT_TABLET_SUPPORT -I/usr/qt/3/mkspecs/linux-g++ -I. -I.. -I../.. -I../libavutil -I/usr/qt/3/include -o mpegvideo.o mpegvideo.c
utils.c:419: error: syntax error before "AVCodecContext"
utils.c:419: error: `bit_rate' undeclared here (not in a function)
utils.c:419: error: initializer element is not constant
utils.c:419: error: (near initialization for `options[0].offset')
utils.c:419: error: initializer element is not constant
utils.c:419: error: (near initialization for `options[0]')
utils.c:420: error: syntax error before "AVCodecContext"
utils.c:420: error: `bit_rate_tolerance' undeclared here (not in a function)
utils.c:420: error: initializer element is not constant
utils.c:420: error: (near initialization for `options[1].offset')
utils.c:420: error: initializer element is not constant
utils.c:420: error: (near initialization for `options[1]')
utils.c:421: error: syntax error before "AVCodecContext"
utils.c:421: error: `flags' undeclared here (not in a function)
utils.c:421: error: initializer element is not constant
utils.c:421: error: (near initialization for `options[2].offset')
utils.c:421: error: initializer element is not constant
utils.c:421: error: (near initialization for `options[2]')
utils.c:422: error: initializer element is not constant
utils.c:422: error: (near initialization for `options[3]')
utils.c:423: error: initializer element is not constant
utils.c:423: error: (near initialization for `options[4]')
utils.c:424: error: initializer element is not constant
utils.c:424: error: (near initialization for `options[5]')
utils.c:425: error: initializer element is not constant
utils.c:425: error: (near initialization for `options[6]')
utils.c:426: error: initializer element is not constant
utils.c:426: error: (near initialization for `options[7]')
utils.c:427: error: initializer element is not constant
utils.c:427: error: (near initialization for `options[8]')
utils.c:428: error: initializer element is not constant
utils.c:428: error: (near initialization for `options[9]')
utils.c:429: error: initializer element is not constant
utils.c:429: error: (near initialization for `options[10]')
utils.c:430: error: initializer element is not constant
utils.c:430: error: (near initialization for `options[11]')
utils.c:431: error: initializer element is not constant
utils.c:431: error: (near initialization for `options[12]')
utils.c:432: error: initializer element is not constant
utils.c:432: error: (near initialization for `options[13]')
utils.c:433: error: initializer element is not constant
utils.c:433: error: (near initialization for `options[14]')
utils.c:434: error: initializer element is not constant
utils.c:434: error: (near initialization for `options[15]')
utils.c:435: error: initializer element is not constant
utils.c:435: error: (near initialization for `options[16]')
utils.c:436: error: initializer element is not constant
utils.c:436: error: (near initialization for `options[17]')
utils.c:437: error: initializer element is not constant
utils.c:437: error: (near initialization for `options[18]')
utils.c:438: error: initializer element is not constant
utils.c:438: error: (near initialization for `options[19]')
utils.c:439: error: initializer element is not constant
utils.c:439: error: (near initialization for `options[20]')
utils.c:440: error: initializer element is not constant
utils.c:440: error: (near initialization for `options[21]')
utils.c:441: error: initializer element is not constant
utils.c:441: error: (near initialization for `options[22]')
utils.c:442: error: initializer element is not constant
utils.c:442: error: (near initialization for `options[23]')
utils.c:443: error: initializer element is not constant
utils.c:443: error: (near initialization for `options[24]')
utils.c:444: error: initializer element is not constant
utils.c:444: error: (near initialization for `options[25]')
utils.c:445: error: initializer element is not constant
utils.c:445: error: (near initialization for `options[26]')
utils.c:446: error: initializer element is not constant
utils.c:446: error: (near initialization for `options[27]')
utils.c:447: error: initializer element is not constant
utils.c:447: error: (near initialization for `options[28]')
utils.c:448: error: initializer element is not constant
utils.c:448: error: (near initialization for `options[29]')
utils.c:449: error: initializer element is not constant
utils.c:449: error: (near initialization for `options[30]')
utils.c:450: error: initializer element is not constant
utils.c:450: error: (near initialization for `options[31]')
utils.c:451: error: initializer element is not constant
utils.c:451: error: (near initialization for `options[32]')
utils.c:452: error: initializer element is not constant
utils.c:452: error: (near initialization for `options[33]')
utils.c:453: error: initializer element is not constant
utils.c:453: error: (near initialization for `options[34]')
utils.c:454: error: initializer element is not constant
utils.c:454: error: (near initialization for `options[35]')
utils.c:455: error: initializer element is not constant
utils.c:455: error: (near initialization for `options[36]')
utils.c:456: error: initializer element is not constant
utils.c:456: error: (near initialization for `options[37]')
utils.c:457: error: initializer element is not constant
utils.c:457: error: (near initialization for `options[38]')
utils.c:458: error: syntax error before "AVCodecContext"
utils.c:458: error: `sub_id' undeclared here (not in a function)
utils.c:458: error: initializer element is not constant
utils.c:458: error: (near initialization for `options[39].offset')
utils.c:458: error: initializer element is not constant
utils.c:458: error: (near initialization for `options[39]')
utils.c:459: error: syntax error before "AVCodecContext"
utils.c:459: error: `me_method' undeclared here (not in a function)
utils.c:459: error: initializer element is not constant
utils.c:459: error: (near initialization for `options[40].offset')
utils.c:459: error: initializer element is not constant
utils.c:459: error: (near initialization for `options[40]')
utils.c:460: error: syntax error before "AVCodecContext"
utils.c:460: error: `extradata_size' undeclared here (not in a function)
utils.c:460: error: initializer element is not constant
utils.c:460: error: (near initialization for `options[41].offset')
utils.c:460: error: initializer element is not constant
utils.c:460: error: (near initialization for `options[41]')
utils.c:461: error: syntax error before "AVCodecContext"
utils.c:461: error: `time_base' undeclared here (not in a function)
utils.c:461: error: initializer element is not constant
utils.c:461: error: (near initialization for `options[42].offset')
utils.c:461: error: initializer element is not constant
utils.c:461: error: (near initialization for `options[42]')
utils.c:462: error: syntax error before "AVCodecContext"
utils.c:462: error: `gop_size' undeclared here (not in a function)
utils.c:462: error: initializer element is not constant
utils.c:462: error: (near initialization for `options[43].offset')
utils.c:462: error: initializer element is not constant
utils.c:462: error: (near initialization for `options[43]')
utils.c:463: error: syntax error before "AVCodecContext"
utils.c:463: error: `rate_emu' undeclared here (not in a function)
utils.c:463: error: initializer element is not constant
utils.c:463: error: (near initialization for `options[44].offset')
utils.c:463: error: initializer element is not constant
utils.c:463: error: (near initialization for `options[44]')
utils.c:464: error: syntax error before "AVCodecContext"
utils.c:464: error: `sample_rate' undeclared here (not in a function)
utils.c:464: error: initializer element is not constant
utils.c:464: error: (near initialization for `options[45].offset')
utils.c:464: error: initializer element is not constant
utils.c:464: error: (near initialization for `options[45]')
utils.c:465: error: syntax error before "AVCodecContext"
utils.c:465: error: `channels' undeclared here (not in a function)
utils.c:465: error: initializer element is not constant
utils.c:465: error: (near initialization for `options[46].offset')
utils.c:465: error: initializer element is not constant
utils.c:465: error: (near initialization for `options[46]')
utils.c:466: error: syntax error before "AVCodecContext"
utils.c:466: error: `cutoff' undeclared here (not in a function)
utils.c:466: error: initializer element is not constant
utils.c:466: error: (near initialization for `options[47].offset')
utils.c:466: error: initializer element is not constant
utils.c:466: error: (near initialization for `options[47]')
utils.c:467: error: syntax error before "AVCodecContext"
utils.c:467: error: `frame_size' undeclared here (not in a function)
utils.c:467: error: initializer element is not constant
utils.c:467: error: (near initialization for `options[48].offset')
utils.c:467: error: initializer element is not constant
utils.c:467: error: (near initialization for `options[48]')
utils.c:468: error: syntax error before "AVCodecContext"
utils.c:468: error: `frame_number' undeclared here (not in a function)
utils.c:468: error: initializer element is not constant
utils.c:468: error: (near initialization for `options[49].offset')
utils.c:468: error: initializer element is not constant
utils.c:468: error: (near initialization for `options[49]')
utils.c:469: error: syntax error before "AVCodecContext"
utils.c:469: error: `real_pict_num' undeclared here (not in a function)
utils.c:469: error: initializer element is not constant
utils.c:469: error: (near initialization for `options[50].offset')
utils.c:469: error: initializer element is not constant
utils.c:469: error: (near initialization for `options[50]')
utils.c:470: error: syntax error before "AVCodecContext"
utils.c:470: error: `delay' undeclared here (not in a function)
utils.c:470: error: initializer element is not constant
utils.c:470: error: (near initialization for `options[51].offset')
utils.c:470: error: initializer element is not constant
utils.c:470: error: (near initialization for `options[51]')
utils.c:471: error: syntax error before "AVCodecContext"
utils.c:471: error: `qcompress' undeclared here (not in a function)
utils.c:471: error: initializer element is not constant
utils.c:471: error: (near initialization for `options[52].offset')
utils.c:471: error: initializer element is not constant
utils.c:471: error: (near initialization for `options[52]')
utils.c:472: error: syntax error before "AVCodecContext"
utils.c:472: error: `qblur' undeclared here (not in a function)
utils.c:472: error: initializer element is not constant
utils.c:472: error: (near initialization for `options[53].offset')
utils.c:472: error: initializer element is not constant
utils.c:472: error: (near initialization for `options[53]')
utils.c:473: error: syntax error before "AVCodecContext"
utils.c:473: error: `qmin' undeclared here (not in a function)
utils.c:473: error: initializer element is not constant
utils.c:473: error: (near initialization for `options[54].offset')
utils.c:473: error: initializer element is not constant
utils.c:473: error: (near initialization for `options[54]')
utils.c:474: error: syntax error before "AVCodecContext"
utils.c:474: error: `qmax' undeclared here (not in a function)
utils.c:474: error: initializer element is not constant
utils.c:474: error: (near initialization for `options[55].offset')
utils.c:474: error: initializer element is not constant
utils.c:474: error: (near initialization for `options[55]')
utils.c:475: error: syntax error before "AVCodecContext"
utils.c:475: error: `max_qdiff' undeclared here (not in a function)
utils.c:475: error: initializer element is not constant
utils.c:475: error: (near initialization for `options[56].offset')
utils.c:475: error: initializer element is not constant
utils.c:475: error: (near initialization for `options[56]')
utils.c:476: error: syntax error before "AVCodecContext"
utils.c:476: error: `max_b_frames' undeclared here (not in a function)
utils.c:476: error: initializer element is not constant
utils.c:476: error: (near initialization for `options[57].offset')
utils.c:476: error: initializer element is not constant
utils.c:476: error: (near initialization for `options[57]')
utils.c:477: error: syntax error before "AVCodecContext"
utils.c:477: error: `b_quant_factor' undeclared here (not in a function)
utils.c:477: error: initializer element is not constant
utils.c:477: error: (near initialization for `options[58].offset')
utils.c:477: error: initializer element is not constant
utils.c:477: error: (near initialization for `options[58]')
utils.c:478: error: syntax error before "AVCodecContext"
utils.c:478: error: `rc_strategy' undeclared here (not in a function)
utils.c:478: error: initializer element is not constant
utils.c:478: error: (near initialization for `options[59].offset')
utils.c:478: error: initializer element is not constant
utils.c:478: error: (near initialization for `options[59]')
utils.c:479: error: syntax error before "AVCodecContext"
utils.c:479: error: `b_frame_strategy' undeclared here (not in a function)
utils.c:479: error: initializer element is not constant
utils.c:479: error: (near initialization for `options[60].offset')
utils.c:479: error: initializer element is not constant
utils.c:479: error: (near initialization for `options[60]')
utils.c:480: error: syntax error before "AVCodecContext"
utils.c:480: error: `hurry_up' undeclared here (not in a function)
utils.c:480: error: initializer element is not constant
utils.c:480: error: (near initialization for `options[61].offset')
utils.c:480: error: initializer element is not constant
utils.c:480: error: (near initialization for `options[61]')
utils.c:481: error: syntax error before "AVCodecContext"
utils.c:481: error: `rtp_mode' undeclared here (not in a function)
utils.c:481: error: initializer element is not constant
utils.c:481: error: (near initialization for `options[62].offset')
utils.c:481: error: initializer element is not constant
utils.c:481: error: (near initialization for `options[62]')
utils.c:482: error: syntax error before "AVCodecContext"
utils.c:482: error: `rtp_payload_size' undeclared here (not in a function)
utils.c:482: error: initializer element is not constant
utils.c:482: error: (near initialization for `options[63].offset')
utils.c:482: error: initializer element is not constant
utils.c:482: error: (near initialization for `options[63]')
utils.c:483: error: syntax error before "AVCodecContext"
utils.c:483: error: `mv_bits' undeclared here (not in a function)
utils.c:483: error: initializer element is not constant
utils.c:483: error: (near initialization for `options[64].offset')
utils.c:483: error: initializer element is not constant
utils.c:483: error: (near initialization for `options[64]')
utils.c:484: error: syntax error before "AVCodecContext"
utils.c:484: error: `header_bits' undeclared here (not in a function)
utils.c:484: error: initializer element is not constant
utils.c:484: error: (near initialization for `options[65].offset')
utils.c:484: error: initializer element is not constant
utils.c:484: error: (near initialization for `options[65]')
utils.c:485: error: syntax error before "AVCodecContext"
utils.c:485: error: `i_tex_bits' undeclared here (not in a function)
utils.c:485: error: initializer element is not constant
utils.c:485: error: (near initialization for `options[66].offset')
utils.c:485: error: initializer element is not constant
utils.c:485: error: (near initialization for `options[66]')
utils.c:486: error: syntax error before "AVCodecContext"
utils.c:486: error: `p_tex_bits' undeclared here (not in a function)
utils.c:486: error: initializer element is not constant
utils.c:486: error: (near initialization for `options[67].offset')
utils.c:486: error: initializer element is not constant
utils.c:486: error: (near initialization for `options[67]')
utils.c:487: error: syntax error before "AVCodecContext"
utils.c:487: error: `i_count' undeclared here (not in a function)
utils.c:487: error: initializer element is not constant
utils.c:487: error: (near initialization for `options[68].offset')
utils.c:487: error: initializer element is not constant
utils.c:487: error: (near initialization for `options[68]')
utils.c:488: error: syntax error before "AVCodecContext"
utils.c:488: error: `p_count' undeclared here (not in a function)
utils.c:488: error: initializer element is not constant
utils.c:488: error: (near initialization for `options[69].offset')
utils.c:488: error: initializer element is not constant
utils.c:488: error: (near initialization for `options[69]')
utils.c:489: error: syntax error before "AVCodecContext"
utils.c:489: error: `skip_count' undeclared here (not in a function)
utils.c:489: error: initializer element is not constant
utils.c:489: error: (near initialization for `options[70].offset')
utils.c:489: error: initializer element is not constant
utils.c:489: error: (near initialization for `options[70]')
utils.c:490: error: syntax error before "AVCodecContext"
utils.c:490: error: `misc_bits' undeclared here (not in a function)
utils.c:490: error: initializer element is not constant
utils.c:490: error: (near initialization for `options[71].offset')
utils.c:490: error: initializer element is not constant
utils.c:490: error: (near initialization for `options[71]')
utils.c:491: error: syntax error before "AVCodecContext"
utils.c:491: error: `frame_bits' undeclared here (not in a function)
utils.c:491: error: initializer element is not constant
utils.c:491: error: (near initialization for `options[72].offset')
utils.c:491: error: initializer element is not constant
utils.c:491: error: (near initialization for `options[72]')
utils.c:492: error: syntax error before "AVCodecContext"
utils.c:492: error: `codec_tag' undeclared here (not in a function)
utils.c:492: error: initializer element is not constant
utils.c:492: error: (near initialization for `options[73].offset')
utils.c:492: error: initializer element is not constant
utils.c:492: error: (near initialization for `options[73]')
utils.c:493: error: syntax error before "AVCodecContext"
utils.c:493: error: `workaround_bugs' undeclared here (not in a function)
utils.c:493: error: initializer element is not constant
utils.c:493: error: (near initialization for `options[74].offset')
utils.c:493: error: initializer element is not constant
utils.c:493: error: (near initialization for `options[74]')
utils.c:494: error: initializer element is not constant
utils.c:494: error: (near initialization for `options[75]')
utils.c:495: error: initializer element is not constant
utils.c:495: error: (near initialization for `options[76]')
utils.c:496: error: initializer element is not constant
utils.c:496: error: (near initialization for `options[77]')
utils.c:497: error: initializer element is not constant
utils.c:497: error: (near initialization for `options[78]')
utils.c:498: error: initializer element is not constant
utils.c:498: error: (near initialization for `options[79]')
utils.c:499: error: initializer element is not constant
utils.c:499: error: (near initialization for `options[80]')
utils.c:500: error: initializer element is not constant
utils.c:500: error: (near initialization for `options[81]')
utils.c:501: error: initializer element is not constant
utils.c:501: error: (near initialization for `options[82]')
utils.c:502: error: initializer element is not constant
utils.c:502: error: (near initialization for `options[83]')
utils.c:503: error: initializer element is not constant
utils.c:503: error: (near initialization for `options[84]')
utils.c:504: error: initializer element is not constant
utils.c:504: error: (near initialization for `options[85]')
utils.c:505: error: initializer element is not constant
utils.c:505: error: (near initialization for `options[86]')
utils.c:506: error: initializer element is not constant
utils.c:506: error: (near initialization for `options[87]')
utils.c:507: error: initializer element is not constant
utils.c:507: error: (near initialization for `options[88]')
utils.c:508: error: initializer element is not constant
utils.c:508: error: (near initialization for `options[89]')
utils.c:509: error: syntax error before "AVCodecContext"
utils.c:509: error: `luma_elim_threshold' undeclared here (not in a function)
utils.c:509: error: initializer element is not constant
utils.c:509: error: (near initialization for `options[90].offset')
utils.c:509: error: initializer element is not constant
utils.c:509: error: (near initialization for `options[90]')
utils.c:510: error: syntax error before "AVCodecContext"
utils.c:510: error: `chroma_elim_threshold' undeclared here (not in a function)
utils.c:510: error: initializer element is not constant
utils.c:510: error: (near initialization for `options[91].offset')
utils.c:510: error: initializer element is not constant
utils.c:510: error: (near initialization for `options[91]')
utils.c:511: error: syntax error before "AVCodecContext"
utils.c:511: error: `strict_std_compliance' undeclared here (not in a function)
utils.c:511: error: initializer element is not constant
utils.c:511: error: (near initialization for `options[92].offset')
utils.c:511: error: initializer element is not constant
utils.c:511: error: (near initialization for `options[92]')
utils.c:512: error: initializer element is not constant
utils.c:512: error: (near initialization for `options[93]')
utils.c:513: error: initializer element is not constant
utils.c:513: error: (near initialization for `options[94]')
utils.c:514: error: initializer element is not constant
utils.c:514: error: (near initialization for `options[95]')
utils.c:515: error: initializer element is not constant
utils.c:515: error: (near initialization for `options[96]')
utils.c:516: error: initializer element is not constant
utils.c:516: error: (near initialization for `options[97]')
utils.c:517: error: syntax error before "AVCodecContext"
utils.c:517: error: `b_quant_offset' undeclared here (not in a function)
utils.c:517: error: initializer element is not constant
utils.c:517: error: (near initialization for `options[98].offset')
utils.c:517: error: initializer element is not constant
utils.c:517: error: (near initialization for `options[98]')
utils.c:518: error: syntax error before "AVCodecContext"
utils.c:518: error: `error_resilience' undeclared here (not in a function)
utils.c:518: error: initializer element is not constant
utils.c:518: error: (near initialization for `options[99].offset')
utils.c:518: error: initializer element is not constant
utils.c:518: error: (near initialization for `options[99]')
utils.c:519: error: initializer element is not constant
utils.c:519: error: (near initialization for `options[100]')
utils.c:520: error: initializer element is not constant
utils.c:520: error: (near initialization for `options[101]')
utils.c:521: error: initializer element is not constant
utils.c:521: error: (near initialization for `options[102]')
utils.c:522: error: initializer element is not constant
utils.c:522: error: (near initialization for `options[103]')
utils.c:523: error: syntax error before "AVCodecContext"
utils.c:523: error: `has_b_frames' undeclared here (not in a function)
utils.c:523: error: initializer element is not constant
utils.c:523: error: (near initialization for `options[104].offset')
utils.c:523: error: initializer element is not constant
utils.c:523: error: (near initialization for `options[104]')
utils.c:524: error: syntax error before "AVCodecContext"
utils.c:524: error: `block_align' undeclared here (not in a function)
utils.c:524: error: initializer element is not constant
utils.c:524: error: (near initialization for `options[105].offset')
utils.c:524: error: initializer element is not constant
utils.c:524: error: (near initialization for `options[105]')
utils.c:525: error: syntax error before "AVCodecContext"
utils.c:525: error: `parse_only' undeclared here (not in a function)
utils.c:525: error: initializer element is not constant
utils.c:525: error: (near initialization for `options[106].offset')
utils.c:525: error: initializer element is not constant
utils.c:525: error: (near initialization for `options[106]')
utils.c:526: error: syntax error before "AVCodecContext"
utils.c:526: error: `mpeg_quant' undeclared here (not in a function)
utils.c:526: error: initializer element is not constant
utils.c:526: error: (near initialization for `options[107].offset')
utils.c:526: error: initializer element is not constant
utils.c:526: error: (near initialization for `options[107]')
utils.c:527: error: syntax error before "AVCodecContext"
utils.c:527: error: `stats_out' undeclared here (not in a function)
utils.c:527: error: initializer element is not constant
utils.c:527: error: (near initialization for `options[108].offset')
utils.c:527: error: initializer element is not constant
utils.c:527: error: (near initialization for `options[108]')
utils.c:528: error: syntax error before "AVCodecContext"
utils.c:528: error: `stats_in' undeclared here (not in a function)
utils.c:528: error: initializer element is not constant
utils.c:528: error: (near initialization for `options[109].offset')
utils.c:528: error: initializer element is not constant
utils.c:528: error: (near initialization for `options[109]')
utils.c:529: error: syntax error before "AVCodecContext"
utils.c:529: error: `rc_qsquish' undeclared here (not in a function)
utils.c:529: error: initializer element is not constant
utils.c:529: error: (near initialization for `options[110].offset')
utils.c:529: error: initializer element is not constant
utils.c:529: error: (near initialization for `options[110]')
utils.c:530: error: syntax error before "AVCodecContext"
utils.c:530: error: `rc_qmod_amp' undeclared here (not in a function)
utils.c:530: error: initializer element is not constant
utils.c:530: error: (near initialization for `options[111].offset')
utils.c:530: error: initializer element is not constant
utils.c:530: error: (near initialization for `options[111]')
utils.c:531: error: syntax error before "AVCodecContext"
utils.c:531: error: `rc_qmod_freq' undeclared here (not in a function)
utils.c:531: error: initializer element is not constant
utils.c:531: error: (near initialization for `options[112].offset')
utils.c:531: error: initializer element is not constant
utils.c:531: error: (near initialization for `options[112]')
utils.c:532: error: syntax error before "AVCodecContext"
utils.c:532: error: `rc_override_count' undeclared here (not in a function)
utils.c:532: error: initializer element is not constant
utils.c:532: error: (near initialization for `options[113].offset')
utils.c:532: error: initializer element is not constant
utils.c:532: error: (near initialization for `options[113]')
utils.c:533: error: syntax error before "AVCodecContext"
utils.c:533: error: `rc_eq' undeclared here (not in a function)
utils.c:533: error: initializer element is not constant
utils.c:533: error: (near initialization for `options[114].offset')
utils.c:533: error: initializer element is not constant
utils.c:533: error: (near initialization for `options[114]')
utils.c:534: error: syntax error before "AVCodecContext"
utils.c:534: error: `rc_max_rate' undeclared here (not in a function)
utils.c:534: error: initializer element is not constant
utils.c:534: error: (near initialization for `options[115].offset')
utils.c:534: error: initializer element is not constant
utils.c:534: error: (near initialization for `options[115]')
utils.c:535: error: syntax error before "AVCodecContext"
utils.c:535: error: `rc_min_rate' undeclared here (not in a function)
utils.c:535: error: initializer element is not constant
utils.c:535: error: (near initialization for `options[116].offset')
utils.c:535: error: initializer element is not constant
utils.c:535: error: (near initialization for `options[116]')
utils.c:536: error: syntax error before "AVCodecContext"
utils.c:536: error: `rc_buffer_size' undeclared here (not in a function)
utils.c:536: error: initializer element is not constant
utils.c:536: error: (near initialization for `options[117].offset')
utils.c:536: error: initializer element is not constant
utils.c:536: error: (near initialization for `options[117]')
utils.c:537: error: syntax error before "AVCodecContext"
utils.c:537: error: `rc_buffer_aggressivity' undeclared here (not in a function)
utils.c:537: error: initializer element is not constant
utils.c:537: error: (near initialization for `options[118].offset')
utils.c:537: error: initializer element is not constant
utils.c:537: error: (near initialization for `options[118]')
utils.c:538: error: syntax error before "AVCodecContext"
utils.c:538: error: `i_quant_factor' undeclared here (not in a function)
utils.c:538: error: initializer element is not constant
utils.c:538: error: (near initialization for `options[119].offset')
utils.c:538: error: initializer element is not constant
utils.c:538: error: (near initialization for `options[119]')
utils.c:539: error: syntax error before "AVCodecContext"
utils.c:539: error: `i_quant_offset' undeclared here (not in a function)
utils.c:539: error: initializer element is not constant
utils.c:539: error: (near initialization for `options[120].offset')
utils.c:539: error: initializer element is not constant
utils.c:539: error: (near initialization for `options[120]')
utils.c:540: error: syntax error before "AVCodecContext"
utils.c:540: error: `rc_initial_cplx' undeclared here (not in a function)
utils.c:540: error: initializer element is not constant
utils.c:540: error: (near initialization for `options[121].offset')
utils.c:540: error: initializer element is not constant
utils.c:540: error: (near initialization for `options[121]')
utils.c:541: error: syntax error before "AVCodecContext"
utils.c:541: error: `dct_algo' undeclared here (not in a function)
utils.c:541: error: initializer element is not constant
utils.c:541: error: (near initialization for `options[122].offset')
utils.c:541: error: initializer element is not constant
utils.c:541: error: (near initialization for `options[122]')
utils.c:542: error: initializer element is not constant
utils.c:542: error: (near initialization for `options[123]')
utils.c:543: error: initializer element is not constant
utils.c:543: error: (near initialization for `options[124]')
utils.c:544: error: initializer element is not constant
utils.c:544: error: (near initialization for `options[125]')
utils.c:545: error: initializer element is not constant
utils.c:545: error: (near initialization for `options[126]')
utils.c:546: error: initializer element is not constant
utils.c:546: error: (near initialization for `options[127]')
utils.c:547: error: initializer element is not constant
utils.c:547: error: (near initialization for `options[128]')
utils.c:548: error: initializer element is not constant
utils.c:548: error: (near initialization for `options[129]')
utils.c:549: error: syntax error before "AVCodecContext"
utils.c:549: error: `lumi_masking' undeclared here (not in a function)
utils.c:549: error: initializer element is not constant
utils.c:549: error: (near initialization for `options[130].offset')
utils.c:549: error: initializer element is not constant
utils.c:549: error: (near initialization for `options[130]')
utils.c:550: error: syntax error before "AVCodecContext"
utils.c:550: error: `temporal_cplx_masking' undeclared here (not in a function)
utils.c:550: error: initializer element is not constant
utils.c:550: error: (near initialization for `options[131].offset')
utils.c:550: error: initializer element is not constant
utils.c:550: error: (near initialization for `options[131]')
utils.c:551: error: syntax error before "AVCodecContext"
utils.c:551: error: `spatial_cplx_masking' undeclared here (not in a function)
utils.c:551: error: initializer element is not constant
utils.c:551: error: (near initialization for `options[132].offset')
utils.c:551: error: initializer element is not constant
utils.c:551: error: (near initialization for `options[132]')
utils.c:552: error: syntax error before "AVCodecContext"
utils.c:552: error: `p_masking' undeclared here (not in a function)
utils.c:552: error: initializer element is not constant
utils.c:552: error: (near initialization for `options[133].offset')
utils.c:552: error: initializer element is not constant
utils.c:552: error: (near initialization for `options[133]')
utils.c:553: error: syntax error before "AVCodecContext"
utils.c:553: error: `dark_masking' undeclared here (not in a function)
utils.c:553: error: initializer element is not constant
utils.c:553: error: (near initialization for `options[134].offset')
utils.c:553: error: initializer element is not constant
utils.c:553: error: (near initialization for `options[134]')
utils.c:554: error: syntax error before "AVCodecContext"
utils.c:554: error: `unused' undeclared here (not in a function)
utils.c:554: error: initializer element is not constant
utils.c:554: error: (near initialization for `options[135].offset')
utils.c:554: error: initializer element is not constant
utils.c:554: error: (near initialization for `options[135]')
utils.c:555: error: syntax error before "AVCodecContext"
utils.c:555: error: `idct_algo' undeclared here (not in a function)
utils.c:555: error: initializer element is not constant
utils.c:555: error: (near initialization for `options[136].offset')
utils.c:555: error: initializer element is not constant
utils.c:555: error: (near initialization for `options[136]')
utils.c:556: error: initializer element is not constant
utils.c:556: error: (near initialization for `options[137]')
utils.c:557: error: initializer element is not constant
utils.c:557: error: (near initialization for `options[138]')
utils.c:558: error: initializer element is not constant
utils.c:558: error: (near initialization for `options[139]')
utils.c:559: error: initializer element is not constant
utils.c:559: error: (near initialization for `options[140]')
utils.c:560: error: initializer element is not constant
utils.c:560: error: (near initialization for `options[141]')
utils.c:561: error: initializer element is not constant
utils.c:561: error: (near initialization for `options[142]')
utils.c:562: error: initializer element is not constant
utils.c:562: error: (near initialization for `options[143]')
utils.c:563: error: initializer element is not constant
utils.c:563: error: (near initialization for `options[144]')
utils.c:564: error: initializer element is not constant
utils.c:564: error: (near initialization for `options[145]')
utils.c:565: error: initializer element is not constant
utils.c:565: error: (near initialization for `options[146]')
utils.c:566: error: initializer element is not constant
utils.c:566: error: (near initialization for `options[147]')
utils.c:567: error: initializer element is not constant
utils.c:567: error: (near initialization for `options[148]')
utils.c:568: error: initializer element is not constant
utils.c:568: error: (near initialization for `options[149]')
utils.c:569: error: initializer element is not constant
utils.c:569: error: (near initialization for `options[150]')
utils.c:570: error: initializer element is not constant
utils.c:570: error: (near initialization for `options[151]')
utils.c:571: error: initializer element is not constant
utils.c:571: error: (near initialization for `options[152]')
utils.c:572: error: syntax error before "AVCodecContext"
utils.c:572: error: `slice_count' undeclared here (not in a function)
utils.c:572: error: initializer element is not constant
utils.c:572: error: (near initialization for `options[153].offset')
utils.c:572: error: initializer element is not constant
utils.c:572: error: (near initialization for `options[153]')
utils.c:573: error: syntax error before "AVCodecContext"
utils.c:573: error: `error_concealment' undeclared here (not in a function)
utils.c:573: error: initializer element is not constant
utils.c:573: error: (near initialization for `options[154].offset')
utils.c:573: error: initializer element is not constant
utils.c:573: error: (near initialization for `options[154]')
utils.c:574: error: initializer element is not constant
utils.c:574: error: (near initialization for `options[155]')
utils.c:575: error: initializer element is not constant
utils.c:575: error: (near initialization for `options[156]')
utils.c:576: error: syntax error before "AVCodecContext"
utils.c:576: error: `bits_per_sample' undeclared here (not in a function)
utils.c:576: error: initializer element is not constant
utils.c:576: error: (near initialization for `options[157].offset')
utils.c:576: error: initializer element is not constant
utils.c:576: error: (near initialization for `options[157]')
utils.c:577: error: syntax error before "AVCodecContext"
utils.c:577: error: `prediction_method' undeclared here (not in a function)
utils.c:577: error: initializer element is not constant
utils.c:577: error: (near initialization for `options[158].offset')
utils.c:577: error: initializer element is not constant
utils.c:577: error: (near initialization for `options[158]')
utils.c:578: error: initializer element is not constant
utils.c:578: error: (near initialization for `options[159]')
utils.c:579: error: initializer element is not constant
utils.c:579: error: (near initialization for `options[160]')
utils.c:580: error: initializer element is not constant
utils.c:580: error: (near initialization for `options[161]')
utils.c:581: error: syntax error before "AVCodecContext"
utils.c:581: error: `sample_aspect_ratio' undeclared here (not in a function)
utils.c:581: error: initializer element is not constant
utils.c:581: error: (near initialization for `options[162].offset')
utils.c:581: error: initializer element is not constant
utils.c:581: error: (near initialization for `options[162]')
utils.c:582: error: syntax error before "AVCodecContext"
utils.c:582: error: `debug' undeclared here (not in a function)
utils.c:582: error: initializer element is not constant
utils.c:582: error: (near initialization for `options[163].offset')
utils.c:582: error: initializer element is not constant
utils.c:582: error: (near initialization for `options[163]')
utils.c:583: error: initializer element is not constant
utils.c:583: error: (near initialization for `options[164]')
utils.c:584: error: initializer element is not constant
utils.c:584: error: (near initialization for `options[165]')
utils.c:585: error: initializer element is not constant
utils.c:585: error: (near initialization for `options[166]')
utils.c:586: error: initializer element is not constant
utils.c:586: error: (near initialization for `options[167]')
utils.c:587: error: initializer element is not constant
utils.c:587: error: (near initialization for `options[168]')
utils.c:588: error: initializer element is not constant
utils.c:588: error: (near initialization for `options[169]')
utils.c:589: error: initializer element is not constant
utils.c:589: error: (near initialization for `options[170]')
utils.c:590: error: initializer element is not constant
utils.c:590: error: (near initialization for `options[171]')
utils.c:591: error: initializer element is not constant
utils.c:591: error: (near initialization for `options[172]')
utils.c:592: error: initializer element is not constant
utils.c:592: error: (near initialization for `options[173]')
utils.c:593: error: initializer element is not constant
utils.c:593: error: (near initialization for `options[174]')
utils.c:594: error: initializer element is not constant
utils.c:594: error: (near initialization for `options[175]')
utils.c:595: error: initializer element is not constant
utils.c:595: error: (near initialization for `options[176]')
utils.c:596: error: initializer element is not constant
utils.c:596: error: (near initialization for `options[177]')
utils.c:597: error: initializer element is not constant
utils.c:597: error: (near initialization for `options[178]')
utils.c:598: error: syntax error before "AVCodecContext"
utils.c:598: error: `debug_mv' undeclared here (not in a function)
utils.c:598: error: initializer element is not constant
utils.c:598: error: (near initialization for `options[179].offset')
utils.c:598: error: initializer element is not constant
utils.c:598: error: (near initialization for `options[179]')
utils.c:599: error: initializer element is not constant
utils.c:599: error: (near initialization for `options[180]')
utils.c:600: error: initializer element is not constant
utils.c:600: error: (near initialization for `options[181]')
utils.c:601: error: initializer element is not constant
utils.c:601: error: (near initialization for `options[182]')
utils.c:602: error: syntax error before "AVCodecContext"
utils.c:602: error: `mb_qmin' undeclared here (not in a function)
utils.c:602: error: initializer element is not constant
utils.c:602: error: (near initialization for `options[183].offset')
utils.c:602: error: initializer element is not constant
utils.c:602: error: (near initialization for `options[183]')
utils.c:603: error: syntax error before "AVCodecContext"
utils.c:603: error: `mb_qmax' undeclared here (not in a function)
utils.c:603: error: initializer element is not constant
utils.c:603: error: (near initialization for `options[184].offset')
utils.c:603: error: initializer element is not constant
utils.c:603: error: (near initialization for `options[184]')
utils.c:604: error: syntax error before "AVCodecContext"
utils.c:604: error: `me_cmp' undeclared here (not in a function)
utils.c:604: error: initializer element is not constant
utils.c:604: error: (near initialization for `options[185].offset')
utils.c:604: error: initializer element is not constant
utils.c:604: error: (near initialization for `options[185]')
utils.c:605: error: syntax error before "AVCodecContext"
utils.c:605: error: `me_sub_cmp' undeclared here (not in a function)
utils.c:605: error: initializer element is not constant
utils.c:605: error: (near initialization for `options[186].offset')
utils.c:605: error: initializer element is not constant
utils.c:605: error: (near initialization for `options[186]')
utils.c:606: error: syntax error before "AVCodecContext"
utils.c:606: error: `mb_cmp' undeclared here (not in a function)
utils.c:606: error: initializer element is not constant
utils.c:606: error: (near initialization for `options[187].offset')
utils.c:606: error: initializer element is not constant
utils.c:606: error: (near initialization for `options[187]')
utils.c:607: error: syntax error before "AVCodecContext"
utils.c:607: error: `ildct_cmp' undeclared here (not in a function)
utils.c:607: error: initializer element is not constant
utils.c:607: error: (near initialization for `options[188].offset')
utils.c:607: error: initializer element is not constant
utils.c:607: error: (near initialization for `options[188]')
utils.c:608: error: syntax error before "AVCodecContext"
utils.c:608: error: `dia_size' undeclared here (not in a function)
utils.c:608: error: initializer element is not constant
utils.c:608: error: (near initialization for `options[189].offset')
utils.c:608: error: initializer element is not constant
utils.c:608: error: (near initialization for `options[189]')
utils.c:609: error: syntax error before "AVCodecContext"
utils.c:609: error: `last_predictor_count' undeclared here (not in a function)
utils.c:609: error: initializer element is not constant
utils.c:609: error: (near initialization for `options[190].offset')
utils.c:609: error: initializer element is not constant
utils.c:609: error: (near initialization for `options[190]')
utils.c:610: error: syntax error before "AVCodecContext"
utils.c:610: error: `pre_me' undeclared here (not in a function)
utils.c:610: error: initializer element is not constant
utils.c:610: error: (near initialization for `options[191].offset')
utils.c:610: error: initializer element is not constant
utils.c:610: error: (near initialization for `options[191]')
utils.c:611: error: syntax error before "AVCodecContext"
utils.c:611: error: `me_pre_cmp' undeclared here (not in a function)
utils.c:611: error: initializer element is not constant
utils.c:611: error: (near initialization for `options[192].offset')
utils.c:611: error: initializer element is not constant
utils.c:611: error: (near initialization for `options[192]')
utils.c:612: error: initializer element is not constant
utils.c:612: error: (near initialization for `options[193]')
utils.c:613: error: initializer element is not constant
utils.c:613: error: (near initialization for `options[194]')
utils.c:614: error: initializer element is not constant
utils.c:614: error: (near initialization for `options[195]')
utils.c:615: error: initializer element is not constant
utils.c:615: error: (near initialization for `options[196]')
utils.c:616: error: initializer element is not constant
utils.c:616: error: (near initialization for `options[197]')
utils.c:617: error: initializer element is not constant
utils.c:617: error: (near initialization for `options[198]')
utils.c:618: error: initializer element is not constant
utils.c:618: error: (near initialization for `options[199]')
utils.c:619: error: initializer element is not constant
utils.c:619: error: (near initialization for `options[200]')
utils.c:620: error: initializer element is not constant
utils.c:620: error: (near initialization for `options[201]')
utils.c:621: error: initializer element is not constant
utils.c:621: error: (near initialization for `options[202]')
utils.c:622: error: initializer element is not constant
utils.c:622: error: (near initialization for `options[203]')
utils.c:624: error: initializer element is not constant
utils.c:624: error: (near initialization for `options[204]')
utils.c:625: error: initializer element is not constant
utils.c:625: error: (near initialization for `options[205]')
utils.c:627: error: initializer element is not constant
utils.c:627: error: (near initialization for `options[206]')
utils.c:628: error: initializer element is not constant
utils.c:628: error: (near initialization for `options[207]')
utils.c:629: error: syntax error before "AVCodecContext"
utils.c:629: error: `pre_dia_size' undeclared here (not in a function)
utils.c:629: error: initializer element is not constant
utils.c:629: error: (near initialization for `options[208].offset')
utils.c:629: error: initializer element is not constant
utils.c:629: error: (near initialization for `options[208]')
utils.c:630: error: syntax error before "AVCodecContext"
utils.c:630: error: `me_subpel_quality' undeclared here (not in a function)
utils.c:630: error: initializer element is not constant
utils.c:630: error: (near initialization for `options[209].offset')
utils.c:630: error: initializer element is not constant
utils.c:630: error: (near initialization for `options[209]')
utils.c:631: error: syntax error before "AVCodecContext"
utils.c:631: error: `dtg_active_format' undeclared here (not in a function)
utils.c:631: error: initializer element is not constant
utils.c:631: error: (near initialization for `options[210].offset')
utils.c:631: error: initializer element is not constant
utils.c:631: error: (near initialization for `options[210]')
utils.c:632: error: syntax error before "AVCodecContext"
utils.c:632: error: `me_range' undeclared here (not in a function)
utils.c:632: error: initializer element is not constant
utils.c:632: error: (near initialization for `options[211].offset')
utils.c:632: error: initializer element is not constant
utils.c:632: error: (near initialization for `options[211]')
utils.c:633: error: syntax error before "AVCodecContext"
utils.c:633: error: `intra_quant_bias' undeclared here (not in a function)
utils.c:633: error: initializer element is not constant
utils.c:633: error: (near initialization for `options[212].offset')
utils.c:633: error: initializer element is not constant
utils.c:633: error: (near initialization for `options[212]')
utils.c:634: error: syntax error before "AVCodecContext"
utils.c:634: error: `inter_quant_bias' undeclared here (not in a function)
utils.c:634: error: initializer element is not constant
utils.c:634: error: (near initialization for `options[213].offset')
utils.c:634: error: initializer element is not constant
utils.c:634: error: (near initialization for `options[213]')
utils.c:635: error: syntax error before "AVCodecContext"
utils.c:635: error: `color_table_id' undeclared here (not in a function)
utils.c:635: error: initializer element is not constant
utils.c:635: error: (near initialization for `options[214].offset')
utils.c:635: error: initializer element is not constant
utils.c:635: error: (near initialization for `options[214]')
utils.c:636: error: syntax error before "AVCodecContext"
utils.c:636: error: `internal_buffer_count' undeclared here (not in a function)
utils.c:636: error: initializer element is not constant
utils.c:636: error: (near initialization for `options[215].offset')
utils.c:636: error: initializer element is not constant
utils.c:636: error: (near initialization for `options[215]')
utils.c:637: error: syntax error before "AVCodecContext"
utils.c:637: error: `global_quality' undeclared here (not in a function)
utils.c:637: error: initializer element is not constant
utils.c:637: error: (near initialization for `options[216].offset')
utils.c:637: error: initializer element is not constant
utils.c:637: error: (near initialization for `options[216]')
utils.c:638: error: syntax error before "AVCodecContext"
utils.c:638: error: `coder_type' undeclared here (not in a function)
utils.c:638: error: initializer element is not constant
utils.c:638: error: (near initialization for `options[217].offset')
utils.c:638: error: initializer element is not constant
utils.c:638: error: (near initialization for `options[217]')
utils.c:639: error: initializer element is not constant
utils.c:639: error: (near initialization for `options[218]')
utils.c:640: error: initializer element is not constant
utils.c:640: error: (near initialization for `options[219]')
utils.c:641: error: syntax error before "AVCodecContext"
utils.c:641: error: `context_model' undeclared here (not in a function)
utils.c:641: error: initializer element is not constant
utils.c:641: error: (near initialization for `options[220].offset')
utils.c:641: error: initializer element is not constant
utils.c:641: error: (near initialization for `options[220]')
utils.c:642: error: syntax error before "AVCodecContext"
utils.c:642: error: `slice_flags' undeclared here (not in a function)
utils.c:642: error: initializer element is not constant
utils.c:642: error: (near initialization for `options[221].offset')
utils.c:642: error: initializer element is not constant
utils.c:642: error: (near initialization for `options[221]')
utils.c:643: error: syntax error before "AVCodecContext"
utils.c:643: error: `xvmc_acceleration' undeclared here (not in a function)
utils.c:643: error: initializer element is not constant
utils.c:643: error: (near initialization for `options[222].offset')
utils.c:643: error: initializer element is not constant
utils.c:643: error: (near initialization for `options[222]')
utils.c:644: error: syntax error before "AVCodecContext"
utils.c:644: error: `mb_decision' undeclared here (not in a function)
utils.c:644: error: initializer element is not constant
utils.c:644: error: (near initialization for `options[223].offset')
utils.c:644: error: initializer element is not constant
utils.c:644: error: (near initialization for `options[223]')
utils.c:645: error: initializer element is not constant
utils.c:645: error: (near initialization for `options[224]')
utils.c:646: error: initializer element is not constant
utils.c:646: error: (near initialization for `options[225]')
utils.c:647: error: initializer element is not constant
utils.c:647: error: (near initialization for `options[226]')
utils.c:648: error: syntax error before "AVCodecContext"
utils.c:648: error: `stream_codec_tag' undeclared here (not in a function)
utils.c:648: error: initializer element is not constant
utils.c:648: error: (near initialization for `options[227].offset')
utils.c:648: error: initializer element is not constant
utils.c:648: error: (near initialization for `options[227]')
utils.c:649: error: syntax error before "AVCodecContext"
utils.c:649: error: `scenechange_threshold' undeclared here (not in a function)
utils.c:649: error: initializer element is not constant
utils.c:649: error: (near initialization for `options[228].offset')
utils.c:649: error: initializer element is not constant
utils.c:649: error: (near initialization for `options[228]')
utils.c:650: error: syntax error before "AVCodecContext"
utils.c:650: error: `lmin' undeclared here (not in a function)
utils.c:650: error: initializer element is not constant
utils.c:650: error: (near initialization for `options[229].offset')
utils.c:650: error: initializer element is not constant
utils.c:650: error: (near initialization for `options[229]')
utils.c:651: error: syntax error before "AVCodecContext"
utils.c:651: error: `lmax' undeclared here (not in a function)
utils.c:651: error: initializer element is not constant
utils.c:651: error: (near initialization for `options[230].offset')
utils.c:651: error: initializer element is not constant
utils.c:651: error: (near initialization for `options[230]')
utils.c:652: error: syntax error before "AVCodecContext"
utils.c:652: error: `noise_reduction' undeclared here (not in a function)
utils.c:652: error: initializer element is not constant
utils.c:652: error: (near initialization for `options[231].offset')
utils.c:652: error: initializer element is not constant
utils.c:652: error: (near initialization for `options[231]')
utils.c:653: error: syntax error before "AVCodecContext"
utils.c:653: error: `rc_initial_buffer_occupancy' undeclared here (not in a function)
utils.c:653: error: initializer element is not constant
utils.c:653: error: (near initialization for `options[232].offset')
utils.c:653: error: initializer element is not constant
utils.c:653: error: (near initialization for `options[232]')
utils.c:654: error: syntax error before "AVCodecContext"
utils.c:654: error: `inter_threshold' undeclared here (not in a function)
utils.c:654: error: initializer element is not constant
utils.c:654: error: (near initialization for `options[233].offset')
utils.c:654: error: initializer element is not constant
utils.c:654: error: (near initialization for `options[233]')
utils.c:655: error: syntax error before "AVCodecContext"
utils.c:655: error: `flags2' undeclared here (not in a function)
utils.c:655: error: initializer element is not constant
utils.c:655: error: (near initialization for `options[234].offset')
utils.c:655: error: initializer element is not constant
utils.c:655: error: (near initialization for `options[234]')
utils.c:656: error: syntax error before "AVCodecContext"
utils.c:656: error: `error_rate' undeclared here (not in a function)
utils.c:656: error: initializer element is not constant
utils.c:656: error: (near initialization for `options[235].offset')
utils.c:656: error: initializer element is not constant
utils.c:656: error: (near initialization for `options[235]')
utils.c:657: error: syntax error before "AVCodecContext"
utils.c:657: error: `antialias_algo' undeclared here (not in a function)
utils.c:657: error: initializer element is not constant
utils.c:657: error: (near initialization for `options[236].offset')
utils.c:657: error: initializer element is not constant
utils.c:657: error: (near initialization for `options[236]')
utils.c:658: error: initializer element is not constant
utils.c:658: error: (near initialization for `options[237]')
utils.c:659: error: initializer element is not constant
utils.c:659: error: (near initialization for `options[238]')
utils.c:660: error: initializer element is not constant
utils.c:660: error: (near initialization for `options[239]')
utils.c:661: error: initializer element is not constant
utils.c:661: error: (near initialization for `options[240]')
utils.c:662: error: syntax error before "AVCodecContext"
utils.c:662: error: `quantizer_noise_shaping' undeclared here (not in a function)
utils.c:662: error: initializer element is not constant
utils.c:662: error: (near initialization for `options[241].offset')
utils.c:662: error: initializer element is not constant
utils.c:662: error: (near initialization for `options[241]')
utils.c:663: error: syntax error before "AVCodecContext"
utils.c:663: error: `thread_count' undeclared here (not in a function)
utils.c:663: error: initializer element is not constant
utils.c:663: error: (near initialization for `options[242].offset')
utils.c:663: error: initializer element is not constant
utils.c:663: error: (near initialization for `options[242]')
utils.c:664: error: syntax error before "AVCodecContext"
utils.c:664: error: `me_threshold' undeclared here (not in a function)
utils.c:664: error: initializer element is not constant
utils.c:664: error: (near initialization for `options[243].offset')
utils.c:664: error: initializer element is not constant
utils.c:664: error: (near initialization for `options[243]')
utils.c:665: error: syntax error before "AVCodecContext"
utils.c:665: error: `mb_threshold' undeclared here (not in a function)
utils.c:665: error: initializer element is not constant
utils.c:665: error: (near initialization for `options[244].offset')
utils.c:665: error: initializer element is not constant
utils.c:665: error: (near initialization for `options[244]')
utils.c:666: error: syntax error before "AVCodecContext"
utils.c:666: error: `intra_dc_precision' undeclared here (not in a function)
utils.c:666: error: initializer element is not constant
utils.c:666: error: (near initialization for `options[245].offset')
utils.c:666: error: initializer element is not constant
utils.c:666: error: (near initialization for `options[245]')
utils.c:667: error: syntax error before "AVCodecContext"
utils.c:667: error: `nsse_weight' undeclared here (not in a function)
utils.c:667: error: initializer element is not constant
utils.c:667: error: (near initialization for `options[246].offset')
utils.c:667: error: initializer element is not constant
utils.c:667: error: (near initialization for `options[246]')
utils.c:668: error: syntax error before "AVCodecContext"
utils.c:668: error: `skip_top' undeclared here (not in a function)
utils.c:668: error: initializer element is not constant
utils.c:668: error: (near initialization for `options[247].offset')
utils.c:668: error: initializer element is not constant
utils.c:668: error: (near initialization for `options[247]')
utils.c:669: error: syntax error before "AVCodecContext"
utils.c:669: error: `skip_bottom' undeclared here (not in a function)
utils.c:669: error: initializer element is not constant
utils.c:669: error: (near initialization for `options[248].offset')
utils.c:669: error: initializer element is not constant
utils.c:669: error: (near initialization for `options[248]')
utils.c:670: error: syntax error before "AVCodecContext"
utils.c:670: error: `profile' undeclared here (not in a function)
utils.c:670: error: initializer element is not constant
utils.c:670: error: (near initialization for `options[249].offset')
utils.c:670: error: initializer element is not constant
utils.c:670: error: (near initialization for `options[249]')
utils.c:671: error: initializer element is not constant
utils.c:671: error: (near initialization for `options[250]')
utils.c:672: error: syntax error before "AVCodecContext"
utils.c:672: error: `level' undeclared here (not in a function)
utils.c:672: error: initializer element is not constant
utils.c:672: error: (near initialization for `options[251].offset')
utils.c:672: error: initializer element is not constant
utils.c:672: error: (near initialization for `options[251]')
utils.c:673: error: initializer element is not constant
utils.c:673: error: (near initialization for `options[252]')
utils.c:674: error: syntax error before "AVCodecContext"
utils.c:674: error: `lowres' undeclared here (not in a function)
utils.c:674: error: initializer element is not constant
utils.c:674: error: (near initialization for `options[253].offset')
utils.c:674: error: initializer element is not constant
utils.c:674: error: (near initialization for `options[253]')
utils.c:675: error: syntax error before "AVCodecContext"
utils.c:675: error: `frame_skip_threshold' undeclared here (not in a function)
utils.c:675: error: initializer element is not constant
utils.c:675: error: (near initialization for `options[254].offset')
utils.c:675: error: initializer element is not constant
utils.c:675: error: (near initialization for `options[254]')
utils.c:676: error: syntax error before "AVCodecContext"
utils.c:676: error: `frame_skip_factor' undeclared here (not in a function)
utils.c:676: error: initializer element is not constant
utils.c:676: error: (near initialization for `options[255].offset')
utils.c:676: error: initializer element is not constant
utils.c:676: error: (near initialization for `options[255]')
utils.c:677: error: syntax error before "AVCodecContext"
utils.c:677: error: `frame_skip_exp' undeclared here (not in a function)
utils.c:677: error: initializer element is not constant
utils.c:677: error: (near initialization for `options[256].offset')
utils.c:677: error: initializer element is not constant
utils.c:677: error: (near initialization for `options[256]')
utils.c:678: error: syntax error before "AVCodecContext"
utils.c:678: error: `frame_skip_cmp' undeclared here (not in a function)
utils.c:678: error: initializer element is not constant
utils.c:678: error: (near initialization for `options[257].offset')
utils.c:678: error: initializer element is not constant
utils.c:678: error: (near initialization for `options[257]')
utils.c:679: error: syntax error before "AVCodecContext"
utils.c:679: error: `border_masking' undeclared here (not in a function)
utils.c:679: error: initializer element is not constant
utils.c:679: error: (near initialization for `options[258].offset')
utils.c:679: error: initializer element is not constant
utils.c:679: error: (near initialization for `options[258]')
utils.c:680: error: syntax error before "AVCodecContext"
utils.c:680: error: `mb_lmin' undeclared here (not in a function)
utils.c:680: error: initializer element is not constant
utils.c:680: error: (near initialization for `options[259].offset')
utils.c:680: error: initializer element is not constant
utils.c:680: error: (near initialization for `options[259]')
utils.c:681: error: syntax error before "AVCodecContext"
utils.c:681: error: `mb_lmax' undeclared here (not in a function)
utils.c:681: error: initializer element is not constant
utils.c:681: error: (near initialization for `options[260].offset')
utils.c:681: error: initializer element is not constant
utils.c:681: error: (near initialization for `options[260]')
utils.c:682: error: syntax error before "AVCodecContext"
utils.c:682: error: `me_penalty_compensation' undeclared here (not in a function)
utils.c:682: error: initializer element is not constant
utils.c:682: error: (near initialization for `options[261].offset')
utils.c:682: error: initializer element is not constant
utils.c:682: error: (near initialization for `options[261]')
utils.c:683: error: syntax error before "AVCodecContext"
utils.c:683: error: `bidir_refine' undeclared here (not in a function)
utils.c:683: error: initializer element is not constant
utils.c:683: error: (near initialization for `options[262].offset')
utils.c:683: error: initializer element is not constant
utils.c:683: error: (near initialization for `options[262]')
utils.c:684: error: syntax error before "AVCodecContext"
utils.c:684: error: `brd_scale' undeclared here (not in a function)
utils.c:684: error: initializer element is not constant
utils.c:684: error: (near initialization for `options[263].offset')
utils.c:684: error: initializer element is not constant
utils.c:684: error: (near initialization for `options[263]')
utils.c:685: error: syntax error before "AVCodecContext"
utils.c:685: error: `crf' undeclared here (not in a function)
utils.c:685: error: initializer element is not constant
utils.c:685: error: (near initialization for `options[264].offset')
utils.c:685: error: initializer element is not constant
utils.c:685: error: (near initialization for `options[264]')
utils.c:686: error: syntax error before "AVCodecContext"
utils.c:686: error: `cqp' undeclared here (not in a function)
utils.c:686: error: initializer element is not constant
utils.c:686: error: (near initialization for `options[265].offset')
utils.c:686: error: initializer element is not constant
utils.c:686: error: (near initialization for `options[265]')
utils.c:687: error: syntax error before "AVCodecContext"
utils.c:687: error: `keyint_min' undeclared here (not in a function)
utils.c:687: error: initializer element is not constant
utils.c:687: error: (near initialization for `options[266].offset')
utils.c:687: error: initializer element is not constant
utils.c:687: error: (near initialization for `options[266]')
utils.c:688: error: syntax error before "AVCodecContext"
utils.c:688: error: `refs' undeclared here (not in a function)
utils.c:688: error: initializer element is not constant
utils.c:688: error: (near initialization for `options[267].offset')
utils.c:688: error: initializer element is not constant
utils.c:688: error: (near initialization for `options[267]')
utils.c:689: error: syntax error before "AVCodecContext"
utils.c:689: error: `chromaoffset' undeclared here (not in a function)
utils.c:689: error: initializer element is not constant
utils.c:689: error: (near initialization for `options[268].offset')
utils.c:689: error: initializer element is not constant
utils.c:689: error: (near initialization for `options[268]')
utils.c:690: error: syntax error before "AVCodecContext"
utils.c:690: error: `bframebias' undeclared here (not in a function)
utils.c:690: error: initializer element is not constant
utils.c:690: error: (near initialization for `options[269].offset')
utils.c:690: error: initializer element is not constant
utils.c:690: error: (near initialization for `options[269]')
utils.c:691: error: syntax error before "AVCodecContext"
utils.c:691: error: `trellis' undeclared here (not in a function)
utils.c:691: error: initializer element is not constant
utils.c:691: error: (near initialization for `options[270].offset')
utils.c:691: error: initializer element is not constant
utils.c:691: error: (near initialization for `options[270]')
utils.c:692: error: syntax error before "AVCodecContext"
utils.c:692: error: `directpred' undeclared here (not in a function)
utils.c:692: error: initializer element is not constant
utils.c:692: error: (near initialization for `options[271].offset')
utils.c:692: error: initializer element is not constant
utils.c:692: error: (near initialization for `options[271]')
utils.c:693: error: initializer element is not constant
utils.c:693: error: (near initialization for `options[272]')
utils.c:694: error: initializer element is not constant
utils.c:694: error: (near initialization for `options[273]')
utils.c:695: error: initializer element is not constant
utils.c:695: error: (near initialization for `options[274]')
utils.c:696: error: initializer element is not constant
utils.c:696: error: (near initialization for `options[275]')
utils.c:697: error: initializer element is not constant
utils.c:697: error: (near initialization for `options[276]')
utils.c:698: error: initializer element is not constant
utils.c:698: error: (near initialization for `options[277]')
utils.c:699: error: initializer element is not constant
utils.c:699: error: (near initialization for `options[278]')
utils.c:700: error: syntax error before "AVCodecContext"
utils.c:700: error: `complexityblur' undeclared here (not in a function)
utils.c:700: error: initializer element is not constant
utils.c:700: error: (near initialization for `options[279].offset')
utils.c:700: error: initializer element is not constant
utils.c:700: error: (near initialization for `options[279]')
utils.c:701: error: syntax error before "AVCodecContext"
utils.c:701: error: `deblockalpha' undeclared here (not in a function)
utils.c:701: error: initializer element is not constant
utils.c:701: error: (near initialization for `options[280].offset')
utils.c:701: error: initializer element is not constant
utils.c:701: error: (near initialization for `options[280]')
utils.c:702: error: syntax error before "AVCodecContext"
utils.c:702: error: `deblockbeta' undeclared here (not in a function)
utils.c:702: error: initializer element is not constant
utils.c:702: error: (near initialization for `options[281].offset')
utils.c:702: error: initializer element is not constant
utils.c:702: error: (near initialization for `options[281]')
utils.c:703: error: syntax error before "AVCodecContext"
utils.c:703: error: `partitions' undeclared here (not in a function)
utils.c:703: error: initializer element is not constant
utils.c:703: error: (near initialization for `options[282].offset')
utils.c:703: error: initializer element is not constant
utils.c:703: error: (near initialization for `options[282]')
utils.c:704: error: initializer element is not constant
utils.c:704: error: (near initialization for `options[283]')
utils.c:705: error: initializer element is not constant
utils.c:705: error: (near initialization for `options[284]')
utils.c:706: error: initializer element is not constant
utils.c:706: error: (near initialization for `options[285]')
utils.c:707: error: initializer element is not constant
utils.c:707: error: (near initialization for `options[286]')
utils.c:708: error: initializer element is not constant
utils.c:708: error: (near initialization for `options[287]')
utils.c:709: error: syntax error before "AVCodecContext"
utils.c:709: error: `scenechange_factor' undeclared here (not in a function)
utils.c:709: error: initializer element is not constant
utils.c:709: error: (near initialization for `options[288].offset')
utils.c:709: error: initializer element is not constant
utils.c:709: error: (near initialization for `options[288]')
utils.c:710: error: syntax error before "AVCodecContext"
utils.c:710: error: `mv0_threshold' undeclared here (not in a function)
utils.c:710: error: initializer element is not constant
utils.c:710: error: (near initialization for `options[289].offset')
utils.c:710: error: initializer element is not constant
utils.c:710: error: (near initialization for `options[289]')
utils.c:711: error: initializer element is not constant
utils.c:711: error: (near initialization for `options[290]')
utils.c:712: error: syntax error before "AVCodecContext"
utils.c:712: error: `b_sensitivity' undeclared here (not in a function)
utils.c:712: error: initializer element is not constant
utils.c:712: error: (near initialization for `options[291].offset')
utils.c:712: error: initializer element is not constant
utils.c:712: error: (near initialization for `options[291]')
utils.c:713: error: syntax error before "AVCodecContext"
utils.c:713: error: `compression_level' undeclared here (not in a function)
utils.c:713: error: initializer element is not constant
utils.c:713: error: (near initialization for `options[292].offset')
utils.c:713: error: initializer element is not constant
utils.c:713: error: (near initialization for `options[292]')
utils.c:714: error: syntax error before "AVCodecContext"
utils.c:714: error: `use_lpc' undeclared here (not in a function)
utils.c:714: error: initializer element is not constant
utils.c:714: error: (near initialization for `options[293].offset')
utils.c:714: error: initializer element is not constant
utils.c:714: error: (near initialization for `options[293]')
utils.c:715: error: syntax error before "AVCodecContext"
utils.c:715: error: `lpc_coeff_precision' undeclared here (not in a function)
utils.c:715: error: initializer element is not constant
utils.c:715: error: (near initialization for `options[294].offset')
utils.c:715: error: initializer element is not constant
utils.c:715: error: (near initialization for `options[294]')
utils.c:716: error: syntax error before "AVCodecContext"
utils.c:716: error: `min_prediction_order' undeclared here (not in a function)
utils.c:716: error: initializer element is not constant
utils.c:716: error: (near initialization for `options[295].offset')
utils.c:716: error: initializer element is not constant
utils.c:716: error: (near initialization for `options[295]')
utils.c:717: error: syntax error before "AVCodecContext"
utils.c:717: error: `max_prediction_order' undeclared here (not in a function)
utils.c:717: error: initializer element is not constant
utils.c:717: error: (near initialization for `options[296].offset')
utils.c:717: error: initializer element is not constant
utils.c:717: error: (near initialization for `options[296]')
utils.c:718: error: syntax error before "AVCodecContext"
utils.c:718: error: `prediction_order_method' undeclared here (not in a function)
utils.c:718: error: initializer element is not constant
utils.c:718: error: (near initialization for `options[297].offset')
utils.c:718: error: initializer element is not constant
utils.c:718: error: (near initialization for `options[297]')
utils.c:719: error: syntax error before "AVCodecContext"
utils.c:719: error: `min_partition_order' undeclared here (not in a function)
utils.c:719: error: initializer element is not constant
utils.c:719: error: (near initialization for `options[298].offset')
utils.c:719: error: initializer element is not constant
utils.c:719: error: (near initialization for `options[298]')
utils.c:720: error: syntax error before "AVCodecContext"
utils.c:720: error: `max_partition_order' undeclared here (not in a function)
utils.c:720: error: initializer element is not constant
utils.c:720: error: (near initialization for `options[299].offset')
utils.c:720: error: initializer element is not constant
utils.c:720: error: (near initialization for `options[299]')
utils.c:721: error: initializer element is not constant
utils.c:721: error: (near initialization for `options[300]')
distcc[19317] ERROR: compile utils.c on 192.168.0.10/2 failed
make[2]: *** [utils.o] Error 1
make[2]: *** Waiting for unfinished jobs....