All pastes #189016 Raw Edit

Something

public text v1 · immutable
·published 2006-10-02 18:48 UTC
rendered paste body
jrs@linuxserver:~/cvs/oe/build$ bitbake libx11
NOTE: Using cache in '/usr/src/universal/dev/build_htcuniversal/cache'
NOTE: Handling BitBake files: - (4031/4031) [100 %]
NOTE: Parsing finished. 3898 cached, 0 parsed, 133 skipped, 0 masked.

NOTE: build 200610022050: started

OE Build Configuration:
BB_VERSION     = "1.6.1"
OE_REVISION    = "86d76364970d255140c3670be920bb87d880487d"
TARGET_ARCH    = "arm"
TARGET_OS      = "linux-gnueabi"
MACHINE        = "htcuniversal"
DISTRO         = "angstrom"
DISTRO_VERSION = "test-20061002"
TARGET_FPU     = "soft"

NOTE: preferred version 2.4 of glibc not available
NOTE: package libx11-X11R7.1-1.0.1: started
NOTE: package libx11-X11R7.1-1.0.1-r1: task do_fetch: started
NOTE: package libx11-X11R7.1-1.0.1-r1: task do_fetch: completed
NOTE: package libx11-X11R7.1-1.0.1-r1: task do_unpack: started
NOTE: Unpacking /usr/src/universal/sources/libX11-X11R7.1-1.0.1.tar.bz2 to /usr/src/universal/dev/build_htcuniversal/work/armv5te-angstrom-linux-gnueabi/libx11-X11R7.1-1.0.1-r1/
NOTE: package libx11-X11R7.1-1.0.1-r1: task do_unpack: completed
NOTE: package libx11-X11R7.1-1.0.1-r1: task do_patch: started
NOTE: package libx11-X11R7.1-1.0.1-r1: task do_patch: completed
NOTE: package libx11-X11R7.1-1.0.1-r1: task do_configure: started
NOTE: package libx11-X11R7.1-1.0.1-r1: task do_configure: completed
NOTE: package libx11-X11R7.1-1.0.1-r1: task do_compile: started
ERROR: function do_compile failed
ERROR: log data follows (/usr/src/universal/dev/build_htcuniversal/work/armv5te-angstrom-linux-gnueabi/libx11-X11R7.1-1.0.1-r1/temp/log.do_compile.9368)
| NOTE: make -C src/util X11_CFLAGS= CC=ccache gcc  LD=ld CXX=ccache g++  CCLD=gcc CFLAGS=-D_GNU_SOURCE -isystem/usr/src/universal/dev/build_htcuniversal/staging/i686-linux/include -Os LDFLAGS=-L/usr/src/universal/dev/build_htcuniversal/staging/i686-linux/lib -Wl,-rpath-link,/usr/src/universal/dev/build_htcuniversal/staging/i686-linux/lib -Wl,-rpath,/usr/src/universal/dev/build_htcuniversal/staging/i686-linux/lib -Wl,-O1 CXXFLAGS=-isystem/usr/src/universal/dev/build_htcuniversal/staging/i686-linux/include -Os -fpermissive CPPFLAGS=-isystem/usr/src/universal/dev/build_htcuniversal/staging/i686-linux/include makekeys
| make: G� til katalog '/usr/src/universal/dev/build_htcuniversal/work/armv5te-angstrom-linux-gnueabi/libx11-X11R7.1-1.0.1-r1/libX11-X11R7.1-1.0.1/src/util'
| if ccache gcc  -DHAVE_CONFIG_H -I. -I/usr/src/universal/dev/build_htcuniversal/work/armv5te-angstrom-linux-gnueabi/libx11-X11R7.1-1.0.1-r1/libX11-X11R7.1-1.0.1/src/util -I../../src -I../../include/X11   -isystem/usr/src/universal/dev/build_htcuniversal/staging/i686-linux/include  -D_GNU_SOURCE -isystem/usr/src/universal/dev/build_htcuniversal/staging/i686-linux/include -Os -MT makekeys-makekeys.o -MD -MP -MF ".deps/makekeys-makekeys.Tpo" -c -o makekeys-makekeys.o `test -f 'makekeys.c' || echo '/usr/src/universal/dev/build_htcuniversal/work/armv5te-angstrom-linux-gnueabi/libx11-X11R7.1-1.0.1-r1/libX11-X11R7.1-1.0.1/src/util/'`makekeys.c; \
|       then mv -f ".deps/makekeys-makekeys.Tpo" ".deps/makekeys-makekeys.Po"; else rm -f ".deps/makekeys-makekeys.Tpo"; exit 1; fi
| makekeys.c:34:19: error: X11/X.h: Ingen slik fil eller filkatalog
| makekeys.c:35:21: error: X11/Xos.h: Ingen slik fil eller filkatalog
| makekeys.c:36:27: error: X11/keysymdef.h: Ingen slik fil eller filkatalog
| makekeys.c:49: error: expected specifier-qualifier-list before 'KeySym'
| makekeys.c:58: error: expected '=', ',', ';', 'asm' or '__attribute__' before 'values'
| makekeys.c: In function 'main':
| makekeys.c:74: error: 'KeySym' undeclared (first use in this function)
| makekeys.c:74: error: (Each undeclared identifier is reported only once
| makekeys.c:74: error: for each function it appears in.)
| makekeys.c:74: error: expected ';' before 'val'
| makekeys.c:80: error: 'struct info' has no member named 'val'
| makekeys.c:87: error: 'struct info' has no member named 'val'
| makekeys.c:87: error: 'struct info' has no member named 'val'
| makekeys.c:98: error: 'struct info' has no member named 'val'
| makekeys.c:98: error: 'XK_VoidSymbol' undeclared (first use in this function)
| makekeys.c:99: error: 'struct info' has no member named 'val'
| makekeys.c:100: error: 'struct info' has no member named 'val'
| makekeys.c:106: warning: incompatible implicit declaration of built-in function 'strlen'
| makekeys.c:111: warning: incompatible implicit declaration of built-in function 'strcpy'
| makekeys.c:177: error: 'val' undeclared (first use in this function)
| makekeys.c:177: error: 'struct info' has no member named 'val'
| makekeys.c:210: error: 'struct info' has no member named 'val'
| makekeys.c:213: error: 'values' undeclared (first use in this function)
| makekeys.c:243: error: 'struct info' has no member named 'val'
| make: *** [makekeys-makekeys.o] Fejl 1
| make: Forlader katalog '/usr/src/universal/dev/build_htcuniversal/work/armv5te-angstrom-linux-gnueabi/libx11-X11R7.1-1.0.1-r1/libX11-X11R7.1-1.0.1/src/util'
| FATAL: oe_runmake failed
NOTE: Task failed: /usr/src/universal/dev/build_htcuniversal/work/armv5te-angstrom-linux-gnueabi/libx11-X11R7.1-1.0.1-r1/temp/log.do_compile.9368
NOTE: package libx11-X11R7.1-1.0.1-r1: task do_compile: failed
ERROR: TaskFailed event exception, aborting
NOTE: package libx11-X11R7.1-1.0.1: failed
ERROR: Build of libx11 failed
jrs@linuxserver:~/cvs/oe/build$ bitbake diet-x11
NOTE: Using cache in '/usr/src/universal/dev/build_htcuniversal/cache'
NOTE: Handling BitBake files: - (4031/4031) [100 %]
NOTE: Parsing finished. 3898 cached, 0 parsed, 133 skipped, 0 masked.

NOTE: build 200610022051: started

OE Build Configuration:
BB_VERSION     = "1.6.1"
OE_REVISION    = "86d76364970d255140c3670be920bb87d880487d"
TARGET_ARCH    = "arm"
TARGET_OS      = "linux-gnueabi"
MACHINE        = "htcuniversal"
DISTRO         = "angstrom"
DISTRO_VERSION = "test-20061002"
TARGET_FPU     = "soft"

NOTE: preferred version 2.4 of glibc not available
NOTE: package diet-x11-X11R7.1-1.0.1: started
NOTE: package diet-x11-X11R7.1-1.0.1-r1: task do_fetch: started
NOTE: package diet-x11-X11R7.1-1.0.1-r1: task do_fetch: completed
NOTE: package diet-x11-X11R7.1-1.0.1-r1: task do_unpack: started
NOTE: Unpacking /usr/src/universal/sources/libX11-X11R7.1-1.0.1.tar.bz2 to /usr/src/universal/dev/build_htcuniversal/work/armv5te-angstrom-linux-gnueabi/diet-x11-X11R7.1-1.0.1-r1/
NOTE: package diet-x11-X11R7.1-1.0.1-r1: task do_unpack: completed
NOTE: package diet-x11-X11R7.1-1.0.1-r1: task do_patch: started
NOTE: Applying patch 'X18NCMSstubs.diff'
NOTE: Applying patch 'fix-disable-xlocale.diff'
NOTE: Applying patch 'fix-utf8-wrong-define.patch'
NOTE: Applying patch 'xim.patch'
NOTE: package diet-x11-X11R7.1-1.0.1-r1: task do_patch: completed
NOTE: package diet-x11-X11R7.1-1.0.1-r1: task do_configure: started
NOTE: package diet-x11-X11R7.1-1.0.1-r1: task do_configure: completed
NOTE: package diet-x11-X11R7.1-1.0.1-r1: task do_compile: started
ERROR: function do_compile failed
ERROR: log data follows (/usr/src/universal/dev/build_htcuniversal/work/armv5te-angstrom-linux-gnueabi/diet-x11-X11R7.1-1.0.1-r1/temp/log.do_compile.18435)
| NOTE: make -C src/util X11_CFLAGS= CC=ccache gcc  LD=ld CXX=ccache g++  CCLD=gcc CFLAGS=-D_GNU_SOURCE -isystem/usr/src/universal/dev/build_htcuniversal/staging/i686-linux/include -Os LDFLAGS=-L/usr/src/universal/dev/build_htcuniversal/staging/i686-linux/lib -Wl,-rpath-link,/usr/src/universal/dev/build_htcuniversal/staging/i686-linux/lib -Wl,-rpath,/usr/src/universal/dev/build_htcuniversal/staging/i686-linux/lib -Wl,-O1 CXXFLAGS=-isystem/usr/src/universal/dev/build_htcuniversal/staging/i686-linux/include -Os -fpermissive CPPFLAGS=-isystem/usr/src/universal/dev/build_htcuniversal/staging/i686-linux/include makekeys
| make: G� til katalog '/usr/src/universal/dev/build_htcuniversal/work/armv5te-angstrom-linux-gnueabi/diet-x11-X11R7.1-1.0.1-r1/libX11-X11R7.1-1.0.1/src/util'
| if ccache gcc  -DHAVE_CONFIG_H -I. -I/usr/src/universal/dev/build_htcuniversal/work/armv5te-angstrom-linux-gnueabi/diet-x11-X11R7.1-1.0.1-r1/libX11-X11R7.1-1.0.1/src/util -I../../src -I../../include/X11   -isystem/usr/src/universal/dev/build_htcuniversal/staging/i686-linux/include  -D_GNU_SOURCE -isystem/usr/src/universal/dev/build_htcuniversal/staging/i686-linux/include -Os -MT makekeys-makekeys.o -MD -MP -MF ".deps/makekeys-makekeys.Tpo" -c -o makekeys-makekeys.o `test -f 'makekeys.c' || echo '/usr/src/universal/dev/build_htcuniversal/work/armv5te-angstrom-linux-gnueabi/diet-x11-X11R7.1-1.0.1-r1/libX11-X11R7.1-1.0.1/src/util/'`makekeys.c; \
|       then mv -f ".deps/makekeys-makekeys.Tpo" ".deps/makekeys-makekeys.Po"; else rm -f ".deps/makekeys-makekeys.Tpo"; exit 1; fi
| makekeys.c:34:19: error: X11/X.h: Ingen slik fil eller filkatalog
| makekeys.c:35:21: error: X11/Xos.h: Ingen slik fil eller filkatalog
| makekeys.c:36:27: error: X11/keysymdef.h: Ingen slik fil eller filkatalog
| makekeys.c:49: error: expected specifier-qualifier-list before 'KeySym'
| makekeys.c:58: error: expected '=', ',', ';', 'asm' or '__attribute__' before 'values'
| makekeys.c: In function 'main':
| makekeys.c:74: error: 'KeySym' undeclared (first use in this function)
| makekeys.c:74: error: (Each undeclared identifier is reported only once
| makekeys.c:74: error: for each function it appears in.)
| makekeys.c:74: error: expected ';' before 'val'
| makekeys.c:80: error: 'struct info' has no member named 'val'
| makekeys.c:87: error: 'struct info' has no member named 'val'
| makekeys.c:87: error: 'struct info' has no member named 'val'
| makekeys.c:98: error: 'struct info' has no member named 'val'
| makekeys.c:98: error: 'XK_VoidSymbol' undeclared (first use in this function)
| makekeys.c:99: error: 'struct info' has no member named 'val'
| makekeys.c:100: error: 'struct info' has no member named 'val'
| makekeys.c:106: warning: incompatible implicit declaration of built-in function 'strlen'
| makekeys.c:111: warning: incompatible implicit declaration of built-in function 'strcpy'
| makekeys.c:177: error: 'val' undeclared (first use in this function)
| makekeys.c:177: error: 'struct info' has no member named 'val'
| makekeys.c:210: error: 'struct info' has no member named 'val'
| makekeys.c:213: error: 'values' undeclared (first use in this function)
| makekeys.c:243: error: 'struct info' has no member named 'val'
| make: *** [makekeys-makekeys.o] Fejl 1
| make: Forlader katalog '/usr/src/universal/dev/build_htcuniversal/work/armv5te-angstrom-linux-gnueabi/diet-x11-X11R7.1-1.0.1-r1/libX11-X11R7.1-1.0.1/src/util'
| FATAL: oe_runmake failed
NOTE: Task failed: /usr/src/universal/dev/build_htcuniversal/work/armv5te-angstrom-linux-gnueabi/diet-x11-X11R7.1-1.0.1-r1/temp/log.do_compile.18435
NOTE: package diet-x11-X11R7.1-1.0.1-r1: task do_compile: failed
ERROR: TaskFailed event exception, aborting
NOTE: package diet-x11-X11R7.1-1.0.1: failed
ERROR: Build of diet-x11 failed