rendered paste body[lamikr@aragorn build]$ ls packages/ipkg
files/ ipkg-native_0.99.148.bb ipkg-0.99.144/
ipkg-collateral/ ipkg-native_0.99.151.bb ipkg_0.99.144.bb
ipkg-collateral.bb ipkg-native_0.99.152.bb ipkg-0.99.146/
ipkg.inc ipkg-0.99.129/ ipkg_0.99.146.bb
ipkg-native.inc ipkg_0.99.129.bb ipkg-0.99.147/
ipkg-native_0.99.129.bb ipkg-0.99.130/ ipkg_0.99.147.bb
ipkg-native_0.99.130.bb ipkg_0.99.130.bb ipkg-0.99.148/
ipkg-native_0.99.135.bb ipkg-0.99.135/ ipkg_0.99.148.bb
ipkg-native_0.99.138.bb ipkg_0.99.135.bb ipkg-0.99.151/
ipkg-native_0.99.140.bb ipkg-0.99.138/ ipkg_0.99.151.bb
ipkg-native_0.99.144.bb ipkg_0.99.138.bb ipkg_0.99.152.bb
ipkg-native_0.99.146.bb ipkg-0.99.140/
ipkg-native_0.99.147.bb ipkg_0.99.140.bb
[lamikr@aragorn build]$ ls -la packages/ipkg
yhteensä 200
drwxr-xr-x 14 lamikr adm 4096 heinä 30 23:27 ./
drwxr-xr-x 1171 lamikr adm 12288 heinä 30 23:27 ../
drwxr-xr-x 2 lamikr adm 24 heinä 30 15:00 files/
drwxr-xr-x 10 lamikr adm 96 heinä 30 15:00 ipkg-collateral/
-rw-r--r-- 1 lamikr adm 495 heinä 30 15:00 ipkg-collateral.bb
-rw-r--r-- 1 lamikr adm 1342 heinä 30 23:27 ipkg.inc
-rw-r--r-- 1 lamikr adm 392 heinä 30 23:27 ipkg-native.inc
-rw-r--r-- 1 lamikr adm 46 heinä 30 15:00 ipkg-native_0.99.129.bb
-rw-r--r-- 1 lamikr adm 46 heinä 30 15:00 ipkg-native_0.99.130.bb
-rw-r--r-- 1 lamikr adm 46 heinä 30 15:00 ipkg-native_0.99.135.bb
-rw-r--r-- 1 lamikr adm 46 heinä 30 15:00 ipkg-native_0.99.138.bb
-rw-r--r-- 1 lamikr adm 46 heinä 30 15:00 ipkg-native_0.99.140.bb
-rw-r--r-- 1 lamikr adm 46 heinä 30 15:00 ipkg-native_0.99.144.bb
-rw-r--r-- 1 lamikr adm 46 heinä 30 15:00 ipkg-native_0.99.146.bb
-rw-r--r-- 1 lamikr adm 46 heinä 30 15:00 ipkg-native_0.99.147.bb
-rw-r--r-- 1 lamikr adm 46 heinä 30 15:00 ipkg-native_0.99.148.bb
-rw-r--r-- 1 lamikr adm 46 heinä 30 15:00 ipkg-native_0.99.151.bb
-rw-r--r-- 1 lamikr adm 46 heinä 30 15:00 ipkg-native_0.99.152.bb
drwxr-xr-x 2 lamikr adm 8 heinä 23 13:51 ipkg-0.99.129/
-rw-r--r-- 1 lamikr adm 253 heinä 30 15:00 ipkg_0.99.129.bb
drwxr-xr-x 2 lamikr adm 8 heinä 23 13:51 ipkg-0.99.130/
-rw-r--r-- 1 lamikr adm 111 heinä 30 15:00 ipkg_0.99.130.bb
drwxr-xr-x 2 lamikr adm 24 heinä 30 15:00 ipkg-0.99.135/
-rw-r--r-- 1 lamikr adm 181 heinä 30 15:00 ipkg_0.99.135.bb
drwxr-xr-x 2 lamikr adm 1 heinä 30 15:00 ipkg-0.99.138/
-rw-r--r-- 1 lamikr adm 17 heinä 30 15:00 ipkg_0.99.138.bb
drwxr-xr-x 2 lamikr adm 16 heinä 30 15:00 ipkg-0.99.140/
-rw-r--r-- 1 lamikr adm 77 heinä 30 15:00 ipkg_0.99.140.bb
drwxr-xr-x 2 lamikr adm 16 heinä 30 15:00 ipkg-0.99.144/
-rw-r--r-- 1 lamikr adm 67 heinä 30 15:00 ipkg_0.99.144.bb
drwxr-xr-x 2 lamikr adm 1 heinä 30 15:00 ipkg-0.99.146/
-rw-r--r-- 1 lamikr adm 17 heinä 30 15:00 ipkg_0.99.146.bb
drwxr-xr-x 2 lamikr adm 16 heinä 30 15:00 ipkg-0.99.147/
-rw-r--r-- 1 lamikr adm 58 heinä 30 15:00 ipkg_0.99.147.bb
drwxr-xr-x 2 lamikr adm 16 heinä 30 15:00 ipkg-0.99.148/
-rw-r--r-- 1 lamikr adm 58 heinä 30 15:00 ipkg_0.99.148.bb
drwxr-xr-x 2 lamikr adm 1 heinä 30 15:00 ipkg-0.99.151/
-rw-r--r-- 1 lamikr adm 17 heinä 30 15:00 ipkg_0.99.151.bb
-rw-r--r-- 1 lamikr adm 17 heinä 30 15:00 ipkg_0.99.152.bb
| Package libipkg was not found in the pkg-config search path.
| Perhaps you should add the directory containing `libipkg.pc'
| to the PKG_CONFIG_PATH environment variable
| No package 'libipkg' found
| In file included from main.c:28:
| packages.h:4:33: libipkg.h: No such file or directory
| In file included from main.c:28:
| packages.h:57: error: syntax error before "pkg_state_status_t"
| packages.h:57: warning: no semicolon at end of struct or union
| packages.h:59: warning: type defaults to `int' in declaration of `msg2front_t'
| packages.h:59: warning: data definition has no type or storage class
| packages.h:75: error: syntax error before "msg2front_t"
| packages.h:75: warning: no semicolon at end of struct or union
| packages.h:75: warning: no semicolon at end of struct or union
| packages.h:77: error: syntax error before '}' token
| packages.h:77: warning: type defaults to `int' in declaration of `content'
| packages.h:77: warning: data definition has no type or storage class
| packages.h:78: error: syntax error before '}' token
| packages.h:79: warning: type defaults to `int' in declaration of `pkmessage_t'
| packages.h:79: warning: data definition has no type or storage class
| main.c: In function `main':
| main.c:46: warning: implicit declaration of function `exit'
| make: *** [main.o] Error 1
| FATAL: oe_runmake failed
NOTE: Task failed: /opt/h6300/oe/tmp/work/gpe-package-0.2-r2/temp/log.do_compile.16985
NOTE: package gpe-package-0.2-r2: task do_compile: failed
ERROR: TaskFailed event exception, aborting
NOTE: package gpe-package-0.2: failed
ERROR: Build of gpe-image failed