All pastes #188910 Raw Edit

polytan

public cpp v1 · immutable
·published 2006-10-02 17:07 UTC
rendered paste body
if x86_64-pc-linux-gnu-g++ -DHAVE_CONFIG_H -I. -I. -I.  -I/usr/include/SDL -D_GNU_SOURCE=1 -D_REENTRANT   -finline-limit=300   -O2 -pipe -march=k8 -MT CrashHandler.o -MD -MP -MF ".deps/CrashHandler.Tpo" \  -c -o CrashHandler.o `test -f 'archutils/Unix/CrashHandler.cpp' || echo './'`archutils/Unix/CrashHandler.cpp; \then mv -f ".deps/CrashHandler.Tpo" ".deps/CrashHandler.Po"; \else rm -f ".deps/CrashHandler.Tpo"; exit 1; \fiif x86_64-pc-linux-gnu-g++ -DHAVE_CONFIG_H -I. -I. -I.  -I/usr/include/SDL -D_GNU_SOURCE=1 -D_REENTRANT   -finline-limit=300   -O2 -pipe -march=k8 -MT CrashHandlerChild.o -MD -MP -MF ".deps/CrashHandlerChild.Tpo" \  -c -o CrashHandlerChild.o `test -f 'archutils/Unix/CrashHandlerChild.cpp' || echo './'`archutils/Unix/CrashHandlerChild.cpp; \then mv -f ".deps/CrashHandlerChild.Tpo" ".deps/CrashHandlerChild.Po"; \else rm -f ".deps/CrashHandlerChild.Tpo"; exit 1; \fiif x86_64-pc-linux-gnu-g++ -DHAVE_CONFIG_H -I. -I. -I.  -I/usr/include/SDL -D_GNU_SOURCE=1 -D_REENTRANT   -finline-limit=300   -O2 -pipe -march=k8 -MT Dialog.o -MD -MP -MF ".deps/Dialog.Tpo" \  -c -o Dialog.o `test -f 'arch/Dialog/Dialog.cpp' || echo './'`arch/Dialog/Dialog.cpp; \then mv -f ".deps/Dialog.Tpo" ".deps/Dialog.Po"; \else rm -f ".deps/Dialog.Tpo"; exit 1; \fiif x86_64-pc-linux-gnu-g++ -DHAVE_CONFIG_H -I. -I. -I.  -I/usr/include/SDL -D_GNU_SOURCE=1 -D_REENTRANT   -finline-limit=300   -O2 -pipe -march=k8 -MT Threads_Pthreads.o -MD -MP -MF ".deps/Threads_Pthreads.Tpo" \  -c -o Threads_Pthreads.o `test -f 'arch/Threads/Threads_Pthreads.cpp' || echo './'`arch/Threads/Threads_Pthreads.cpp; \then mv -f ".deps/Threads_Pthreads.Tpo" ".deps/Threads_Pthreads.Po"; \else rm -f ".deps/Threads_Pthreads.Tpo"; exit 1; \fiarch/Threads/Threads_Pthreads.cpp: In member function ‘virtual int ThreadImpl_Pthreads::Wait()’:arch/Threads/Threads_Pthreads.cpp:47: erreur: cast from ‘void*’ to ‘int’ loses precisionmake[2]: *** [Threads_Pthreads.o] Erreur 1make[2]: Leaving directory `/var/tmp/portage/stepmania-3.9/work/StepMania-3.9-src/src'make[1]: *** [all] Erreur 2make[1]: Leaving directory `/var/tmp/portage/stepmania-3.9/work/StepMania-3.9-src/src'make: *** [all-recursive] Erreur 1!!! ERROR: games-arcade/stepmania-3.9 failed.Call stack:  ebuild.sh, line 1546:   Called dyn_compile  ebuild.sh, line 937:   Called src_compile  stepmania-3.9.ebuild, line 54:   Called die!!! Make failed!!! If you need support, post the topmost build error, and the call stack if relevant.