All pastes #188010 Raw Edit

Unnamed

public text v1 · immutable
·published 2006-10-01 18:02 UTC
rendered paste body
E -D_GNU_SOURCE -D_LARGEFILE64_SOURCE -D_POSIX_PTHREAD_SEMANTICS -D_REENTRANT -DG_DISABLE_DEPRECATED -Os -march=i586 -mno-tls-direct-seg-refs -mmmx -m32 -MT sucky-desktop-item.lo -MD -MP -MF .deps/sucky-desktop-item.Tpo -c sucky-desktop-item.c  -fPIC -DPIC -o .libs/sucky-desktop-item.o
gtkfilesystemgnomevfs.c: In function 'gtk_file_system_gnome_vfs_iface_init':
gtkfilesystemgnomevfs.c:387: warning: assignment from incompatible pointer type
gtkfilesystemgnomevfs.c:388: warning: assignment from incompatible pointer type
gtkfilesystemgnomevfs.c:392: warning: assignment from incompatible pointer type
gtkfilesystemgnomevfs.c:394: error: 'GtkFileSystemIface' has no member named 'volume_render_icon'
gtkfilesystemgnomevfs.c:402: error: 'GtkFileSystemIface' has no member named 'render_icon'
make[2]: *** [gtkfilesystemgnomevfs.lo] Error 1
make[2]: *** Waiting for unfinished jobs....
 i586-pc-linux-gnu-gcc -DHAVE_CONFIG_H -I. -I. -I.. -I.. -I.. -DORBIT2=1 -pthread -I/usr/include/gtk-2.0 -I/usr/lib/gtk-2.0/include -I/usr/include/atk-1.0 -I/usr/include/cairo -I/usr/include/pango-1.0 -I/usr/include/glib-2.0 -I/usr/lib/glib-2.0/include -I/usr/include/libgnome-2.0 -I/usr/include/orbit-2.0 -I/usr/include/libbonobo-2.0 -I/usr/include/gconf/2 -I/usr/include/gnome-vfs-2.0 -I/usr/lib/gnome-vfs-2.0/include -I/usr/include/bonobo-activation-2.0 -D_FILE_OFFSET_BITS=64 -D_BSD_SOURCE -D_GNU_SOURCE -D_LARGEFILE64_SOURCE -D_POSIX_PTHREAD_SEMANTICS -D_REENTRANT -DG_DISABLE_DEPRECATED -Os -march=i586 -mno-tls-direct-seg-refs -mmmx -m32 -MT sucky-desktop-item.lo -MD -MP -MF .deps/sucky-desktop-item.Tpo -c sucky-desktop-item.c -o sucky-desktop-item.o >/dev/null 2>&1
make[1]: *** [all-recursive] Error 1
make: *** [all] Error 2

!!! ERROR: gnome-base/libgnomeui-2.14.1 failed.
Call stack:
  ebuild.sh, line 1546:   Called dyn_compile
  ebuild.sh, line 937:   Called src_compile
  ebuild.sh, line 1255:   Called gnome2_src_compile
  gnome2.eclass, line 64:   Called die

!!! compile failure
!!! If you need support, post the topmost build error, and the call stack if relevant.