jrs@linuxserver:~/cvs/oe/build$ bitbake task-bootstrap
NOTE: Using cache in '/usr/src/universal/dev/build_htcuniversal/cache'
NOTE: Handling BitBake files: | (4029/4029) [100 %]
NOTE: Parsing finished. 3896 cached, 0 parsed, 133 skipped, 0 masked.
NOTE: build 200610011400: started
OE Build Configuration:
BB_VERSION = "1.6.1"
OE_REVISION = "6fc8e3fb64f74a49c401459a8d48983e776a84eb"
TARGET_ARCH = "arm"
TARGET_OS = "linux"
MACHINE = "htcuniversal"
DISTRO = "familiar"
DISTRO_VERSION = "unstable-20061001"
TARGET_FPU = ""
NOTE: package diet-x11-X11R7.1-1.0.1: started
NOTE: package diet-x11-X11R7.1-1.0.1-r1: task do_compile: started
ERROR: function do_compile failed
ERROR: log data follows (/usr/src/universal/dev/build_htcuniversal/work/armv5te-linux/diet-x11-X11R7.1-1.0.1-r1/temp/log.do_compile.7552)
| NOTE: make -C src/util X11_CFLAGS= CC=ccache gcc LD=ld CXX=ccache g++ CCLD=gcc CFLAGS=-D_GNU_SOURCE -isystem/usr/src/universal/dev/build_htcuniversal/staging/i686-linux/include -O2 LDFLAGS=-L/usr/src/universal/dev/build_htcuniversal/staging/i686-linux/lib -Wl,-rpath-link,/usr/src/universal/dev/build_htcuniversal/staging/i686-linux/lib -Wl,-rpath,/usr/src/universal/dev/build_htcuniversal/staging/i686-linux/lib -Wl,-O1 CXXFLAGS=-isystem/usr/src/universal/dev/build_htcuniversal/staging/i686-linux/include -O2 -fpermissive CPPFLAGS=-isystem/usr/src/universal/dev/build_htcuniversal/staging/i686-linux/include makekeys
| make: G� til katalog '/usr/src/universal/dev/build_htcuniversal/work/armv5te-linux/diet-x11-X11R7.1-1.0.1-r1/libX11-X11R7.1-1.0.1/src/util'
| if ccache gcc -DHAVE_CONFIG_H -I. -I/usr/src/universal/dev/build_htcuniversal/work/armv5te-linux/diet-x11-X11R7.1-1.0.1-r1/libX11-X11R7.1-1.0.1/src/util -I../../src -I../../include/X11 -isystem/usr/src/universal/dev/build_htcuniversal/staging/i686-linux/include -D_GNU_SOURCE -isystem/usr/src/universal/dev/build_htcuniversal/staging/i686-linux/include -O2 -MT makekeys-makekeys.o -MD -MP -MF ".deps/makekeys-makekeys.Tpo" -c -o makekeys-makekeys.o `test -f 'makekeys.c' || echo '/usr/src/universal/dev/build_htcuniversal/work/armv5te-linux/diet-x11-X11R7.1-1.0.1-r1/libX11-X11R7.1-1.0.1/src/util/'`makekeys.c; \
| then mv -f ".deps/makekeys-makekeys.Tpo" ".deps/makekeys-makekeys.Po"; else rm -f ".deps/makekeys-makekeys.Tpo"; exit 1; fi
| makekeys.c:34:19: error: X11/X.h: Ingen slik fil eller filkatalog
| makekeys.c:35:21: error: X11/Xos.h: Ingen slik fil eller filkatalog
| makekeys.c:36:27: error: X11/keysymdef.h: Ingen slik fil eller filkatalog
| makekeys.c:49: error: expected specifier-qualifier-list before 'KeySym'
| makekeys.c:58: error: expected '=', ',', ';', 'asm' or '__attribute__' before 'values'
| makekeys.c: In function 'main':
| makekeys.c:74: error: 'KeySym' undeclared (first use in this function)
| makekeys.c:74: error: (Each undeclared identifier is reported only once
| makekeys.c:74: error: for each function it appears in.)
| makekeys.c:74: error: expected ';' before 'val'
| makekeys.c:80: error: 'struct info' has no member named 'val'
| makekeys.c:87: error: 'struct info' has no member named 'val'
| makekeys.c:87: error: 'struct info' has no member named 'val'
| makekeys.c:98: error: 'struct info' has no member named 'val'
| makekeys.c:98: error: 'XK_VoidSymbol' undeclared (first use in this function)
| makekeys.c:99: error: 'struct info' has no member named 'val'
| makekeys.c:100: error: 'struct info' has no member named 'val'
| makekeys.c:106: warning: incompatible implicit declaration of built-in function 'strlen'
| makekeys.c:111: warning: incompatible implicit declaration of built-in function 'strcpy'
| makekeys.c:177: error: 'val' undeclared (first use in this function)
| makekeys.c:177: error: 'struct info' has no member named 'val'
| makekeys.c:210: error: 'struct info' has no member named 'val'
| makekeys.c:213: error: 'values' undeclared (first use in this function)
| makekeys.c:243: error: 'struct info' has no member named 'val'
| make: *** [makekeys-makekeys.o] Fejl 1
| make: Forlader katalog '/usr/src/universal/dev/build_htcuniversal/work/armv5te-linux/diet-x11-X11R7.1-1.0.1-r1/libX11-X11R7.1-1.0.1/src/util'
| FATAL: oe_runmake failed
NOTE: Task failed: /usr/src/universal/dev/build_htcuniversal/work/armv5te-linux/diet-x11-X11R7.1-1.0.1-r1/temp/log.do_compile.7552
NOTE: package diet-x11-X11R7.1-1.0.1-r1: task do_compile: failed
ERROR: TaskFailed event exception, aborting
NOTE: package diet-x11-X11R7.1-1.0.1: failed
ERROR: Build of task-bootstrap failed