rendered paste body32/_clzsi2.o libgcc/32/_clzdi2.o libgcc/32/_ctzsi2.o libgcc/32/_ctzdi2.o libgcc/32/_popcount_tab.o libgcc/32/_popcountsi2.o libgcc/32/_popcountdi2.o libgcc/32/_paritysi2.o libgcc/32/_paritydi2.o libgcc/32/_divdi3.o libgcc/32/_moddi3.o libgcc/32/_udivdi3.o libgcc/32/_umoddi3.o libgcc/32/_udiv_w_sdiv.o libgcc/32/_udivmoddi4.o libgcc/32/unwind-dw2.o libgcc/32/unwind-dw2-fde-glibc.o libgcc/32/unwind-sjlj.o libgcc/32/gthr-gnat.o libgcc/32/unwind-c.o -lc && rm -f libgcc_s_32.so && if [ -f 32/libgcc_s.so.1 ]; then mv -f 32/libgcc_s.so.1 32/libgcc_s.so.1.`basename `; else true; fi && mv 32/libgcc_s.so.1.tmp 32/libgcc_s.so.1 && ln -s 32/libgcc_s.so.1 libgcc_s_32.so
/usr/x86_64-pc-linux-gnu/bin/ld: skipping incompatible /usr/lib/gcc/x86_64-pc-linux-gnu/3.4.3/../../../libc.so when searching for -lc
/usr/x86_64-pc-linux-gnu/bin/ld: skipping incompatible /usr/lib/gcc/x86_64-pc-linux-gnu/3.4.3/../../../libc.a when searching for -lc
/usr/x86_64-pc-linux-gnu/bin/ld: skipping incompatible /usr/lib/libc.so when searching for -lc
/usr/x86_64-pc-linux-gnu/bin/ld: skipping incompatible /usr/lib/libc.a when searching for -lc
/usr/x86_64-pc-linux-gnu/bin/ld: cannot find -lc
collect2: ld returned 1 exit status
make[3]: *** [32/libgcc_s_32.so] Error 1
make[3]: Leaving directory `/var/tmp/portage/gcc-3.4.3-r1/work/build/gcc'
make[2]: *** [stmp-multilib] Error 2
make[2]: Leaving directory `/var/tmp/portage/gcc-3.4.3-r1/work/build/gcc'
make[1]: *** [stage1_build] Error 2
make[1]: Leaving directory `/var/tmp/portage/gcc-3.4.3-r1/work/build/gcc'
make: *** [profiledbootstrap] Error 2
!!! ERROR: sys-devel/gcc-3.4.3-r1 failed.
!!! Function gcc_do_make, Line 1214, Exitcode 2
!!! emake failed with profiledbootstrap
!!! If you need support, post the topmost build error, NOT this status message.