All pastes #187114 Raw Edit

morph

public text v1 · immutable
#187114 ·published 2006-09-30 20:28 UTC
rendered paste body
dbus-glib.c:108: error: `c' undeclared (first use in this function)
dbus-glib.c:110: error: syntax error before ')' token
dbus-glib.c:111: warning: implicit declaration of function `dbus_mes
sage_unref'
dbus-glib.c: In function `dbus_connection_get_g_type':
dbus-glib.c:189: error: `dbus_connection_ref' undeclared (first use
in this function)
dbus-glib.c:190: error: `dbus_connection_unref' undeclared (first us
e in this function)
dbus-glib.c: In function `dbus_message_get_g_type':
dbus-glib.c:207: error: `dbus_message_ref' undeclared (first use in
this function)
dbus-glib.c:208: error: `dbus_message_unref' undeclared (first use i
n this function)
dbus-glib.c: At top level:
dbus-glib.c:255: error: syntax error before '*' token
dbus-glib.c:257: warning: return type defaults to `int'
dbus-glib.c: In function `dbus_g_connection_get_connection':
dbus-glib.c:258: error: `DBusConnection' undeclared (first use in th
is function)
dbus-glib.c:258: error: syntax error before ')' token
dbus-glib.c: At top level:
dbus-glib.c:267: error: syntax error before '*' token
dbus-glib.c:269: warning: return type defaults to `int'
dbus-glib.c: In function `dbus_g_message_get_message':
dbus-glib.c:270: error: `DBusMessage' undeclared (first use in this                                                                          function)
dbus-glib.c:270: error: syntax error before ')' token
make[4]: *** [dbus-glib.lo] Erreur 1
make[4]: Leaving directory `/tmp/dbus-glib-0.71/dbus'
make[3]: *** [all-recursive] Erreur 1
make[3]: Leaving directory `/tmp/dbus-glib-0.71/dbus'
make[2]: *** [all] Erreur 2
make[2]: Leaving directory `/tmp/dbus-glib-0.71/dbus'
make[1]: *** [all-recursive] Erreur 1
make[1]: Leaving directory `/tmp/dbus-glib-0.71'
make: *** [all] Erreur 2