rendered paste body$ make depend
make[1]: Entering directory `/home/plouj/apps/build_dir/tools'
../tools/makedep -C../../wine-git/tools -S../../wine-git -T.. -I/usr/include/freetype2 bin2res.c fnt2bdf.c fnt2fon.c make_ctests.c makedep.c relpath.c sfnt2fnt.c
make[1]: ../tools/makedep: Command not found
make[1]: [Makefile] Error 127 (ignored)
make[1]: `../../wine-git/tools/makedep' is up to date.
make[1]: Leaving directory `/home/plouj/apps/build_dir/tools'
make[1]: Entering directory `/home/plouj/apps/build_dir/dlls'
make[2]: Entering directory `/home/plouj/apps/build_dir/dlls/activeds'
../../tools/makedep -C../../../wine-git/dlls/activeds -S../../../wine-git -T../.. activeds_main.c
make[2]: ../../tools/makedep: Command not found
make[2]: [Makefile] Error 127 (ignored)
../../tools/makedep -C../../../wine-git/dlls/activeds -S../../../wine-git -T../.. activeds_main.c
make[2]: ../../tools/makedep: Command not found
make[2]: *** [depend] Error 127
make[2]: Leaving directory `/home/plouj/apps/build_dir/dlls/activeds'
make[1]: *** [activeds/__depend__] Error 2
make[1]: Leaving directory `/home/plouj/apps/build_dir/dlls'
make: *** [dlls/__depend__] Error 2