All pastes #186446 Raw Edit

Stuff

public text v1 · immutable
#186446 ·published 2006-09-29 22:59 UTC
rendered paste body
OTE: make
make -r PARALLELMFLAGS="" CVSOPTS="" -C /usr/src/universal/dev/build_htcuniversal/work/armv5te-linux/glibc-2.3.5+cvs20050627-r12/libc objdir$
make[1]: Entering directory `/usr/src/universal/dev/build_htcuniversal/work/armv5te-linux/glibc-2.3.5+cvs20050627-r12/libc'
make  -C csu subdir_lib
make[2]: Entering directory `/usr/src/universal/dev/build_htcuniversal/work/armv5te-linux/glibc-2.3.5+cvs20050627-r12/libc/csu'
make[2]: Leaving directory `/usr/src/universal/dev/build_htcuniversal/work/armv5te-linux/glibc-2.3.5+cvs20050627-r12/libc/csu'
make[2]: Entering directory `/usr/src/universal/dev/build_htcuniversal/work/armv5te-linux/glibc-2.3.5+cvs20050627-r12/libc/csu'
ccache arm-linux-gcc -march=armv5te -mtune=xscale ../sysdeps/wordsize-32/divdi3.c -c -std=gnu99 -O2 -Wall -Winline -Wstrict-prototypes -Wwri$
/tmp/cc8dEaTb.s: Assembler messages:
/tmp/cc8dEaTb.s:508: Error: symbol definition loop encountered at `__divdi3_internal'
/tmp/cc8dEaTb.s:508: Error: symbol definition loop encountered at `__udivdi3_internal'
/tmp/cc8dEaTb.s:508: Error: symbol definition loop encountered at `__moddi3_internal'
/tmp/cc8dEaTb.s:508: Error: symbol definition loop encountered at `__umoddi3_internal'
make[2]: *** [/usr/src/universal/dev/build_htcuniversal/work/armv5te-linux/glibc-2.3.5+cvs20050627-r12/build-arm-linux/csu/divdi3.os] Error 1
make[2]: Leaving directory `/usr/src/universal/dev/build_htcuniversal/work/armv5te-linux/glibc-2.3.5+cvs20050627-r12/libc/csu'
make[1]: *** [csu/subdir_lib] Error 2
make[1]: Leaving directory `/usr/src/universal/dev/build_htcuniversal/work/armv5te-linux/glibc-2.3.5+cvs20050627-r12/libc'
make: *** [all] Error 2
FATAL: oe_runmake failed