xenpt:/usr/local/src/apaches/php-5.0.3 # make
/bin/sh /usr/local/src/apaches/php-5.0.3/libtool --silent --preserve-dup-deps --mode=compile gcc -Iext/libxml/ -I/usr/local/src/apaches/php-5.0.3/ext/libxml/ -DPHP_ATOM_INC -I/usr/local/src/apaches/php-5.0.3/include -I/usr/local/src/apaches/php-5.0.3/main -I/usr/local/src/apaches/php-5.0.3 -I/usr/local/src/apaches/php-5.0.3/Zend -I/usr/include/libxml2 -I/usr/local/src/apaches/php-5.0.3/ext/mbstring/oniguruma -I/usr/local/src/apaches/php-5.0.3/ext/mbstring/libmbfl -I/usr/local/src/apaches/php-5.0.3/ext/mbstring/libmbfl/mbfl -I/usr/local/freetds/include -I/usr/include/mysql -I/usr/include/pgsql -I/usr/local/src/apaches/php-5.0.3/TSRM -g -O2 -prefer-pic -c /usr/local/src/apaches/php-5.0.3/ext/libxml/libxml.c -o ext/libxml/libxml.lo
In file included from /usr/local/src/apaches/php-5.0.3/Zend/zend_API.h:26,
from /usr/local/src/apaches/php-5.0.3/main/php.h:38,
from /usr/local/src/apaches/php-5.0.3/ext/libxml/libxml.c:28:
/usr/local/src/apaches/php-5.0.3/Zend/zend_modules.h:34: error: array type has incomplete element type
/usr/local/src/apaches/php-5.0.3/Zend/zend_modules.h:35: error: array type has incomplete element type
/usr/local/src/apaches/php-5.0.3/Zend/zend_modules.h:36: error: array type has incomplete element type
/usr/local/src/apaches/php-5.0.3/Zend/zend_modules.h:37: error: array type has incomplete element type
/usr/local/src/apaches/php-5.0.3/Zend/zend_modules.h:38: error: array type has incomplete element type
make: *** [ext/libxml/libxml.lo] Error 1
xenpt:/usr/local/src/apaches/php-5.0.3 #