All pastes #1859773 Raw Edit

Untitled

public text v1 · immutable
#1859773 ·published 2010-04-14 10:18 UTC
rendered paste body
I: using fakeroot in build.
Current time: Wed Apr 14 12:10:43 CEST 2010
pbuilder-time-stamp: 1271239843
Building the build Environment
 -> extracting base tarball [/home/builder/wince-packager/mill/pbuilder/base/base.tgz]
 -> creating local configuration
 -> copying local configuration
 -> mounting /proc filesystem
 -> mounting /dev/pts filesystem
-> Mounting /home/builder/wince-packager/mill/pbuilder/extra-pkg
 -> policy-rc.d already exists
Obtaining the cached apt archive contents
Installing the build-deps
 -> Attempting to satisfy build-dependencies
 -> Creating pbuilder-satisfydepends-dummy package
Package: pbuilder-satisfydepends-dummy
Version: 0.invalid.0
Architecture: i386
Maintainer: Debian Pbuilder Team <pbuilder-maint@lists.alioth.debian.org>
Description: Dummy package to satisfy dependencies with aptitude - created by pbuilder
 This package was created automatically by pbuilder and should
Depends: debhelper (>= 4.1), gettext, zlib1g-dev | libz-dev, libldap2-dev, file, libbz2-dev, libgpg-error-ce-arm-dev (>= 1.8), libassuan-ce-arm-dev, libgcrypt-ce-arm-dev, libksba-ce-arm-dev, libpth-ce-arm-dev, libusb-dev, texinfo, transfig, gs, libreadline5-dev, libcurl3-gnutls-dev
dpkg-deb: building package `pbuilder-satisfydepends-dummy' in `/tmp/satisfydepends-aptitude/pbuilder-satisfydepends-dummy.deb'.
Reading package lists...
Building dependency tree...
Reading state information...
aptitude is already the newest version.
0 upgraded, 0 newly installed, 0 to remove and 0 not upgraded.
Selecting previously deselected package pbuilder-satisfydepends-dummy.
(Reading database ... 15527 files and directories currently installed.)
Unpacking pbuilder-satisfydepends-dummy (from .../pbuilder-satisfydepends-dummy.deb) ...
dpkg: dependency problems prevent configuration of pbuilder-satisfydepends-dummy:
 pbuilder-satisfydepends-dummy depends on zlib1g-dev | libz-dev; however:
  Package zlib1g-dev is not installed.
  Package libz-dev is not installed.
 pbuilder-satisfydepends-dummy depends on libldap2-dev; however:
  Package libldap2-dev is not installed.
 pbuilder-satisfydepends-dummy depends on libbz2-dev; however:
  Package libbz2-dev is not installed.
 pbuilder-satisfydepends-dummy depends on libgpg-error-ce-arm-dev (>= 1.8); however:
  Package libgpg-error-ce-arm-dev is not installed.
 pbuilder-satisfydepends-dummy depends on libassuan-ce-arm-dev; however:
  Package libassuan-ce-arm-dev is not installed.
 pbuilder-satisfydepends-dummy depends on libgcrypt-ce-arm-dev; however:
  Package libgcrypt-ce-arm-dev is not installed.
 pbuilder-satisfydepends-dummy depends on libksba-ce-arm-dev; however:
  Package libksba-ce-arm-dev is not installed.
 pbuilder-satisfydepends-dummy depends on libpth-ce-arm-dev; however:
  Package libpth-ce-arm-dev is not installed.
 pbuilder-satisfydepends-dummy depends on libusb-dev; however:
  Package libusb-dev is not installed.
 pbuilder-satisfydepends-dummy depends on gs; however:
  Package gs is not installed.
 pbuilder-satisfydepends-dummy depends on libreadline5-dev; however:
  Package libreadline5-dev is not installed.
 pbuilder-satisfydepends-dummy depends on libcurl3-gnutls-dev; however:
  Package libcurl3-gnutls-dev is not installed.
dpkg: error processing pbuilder-satisfydepends-dummy (--install):
 dependency problems - leaving unconfigured
Errors were encountered while processing:
 pbuilder-satisfydepends-dummy
Reading package lists...
Building dependency tree...
Reading state information...
Initializing package states...
Writing extended state information...
The following NEW packages will be installed:
  comerr-dev{a} ghostscript-x{a} gs{a} libassuan-ce-arm-dev{a} 
  libbz2-dev{a} libcurl4-gnutls-dev{a} libgcrypt-ce-arm-dev{a} 
  libgcrypt11-dev{a} libglib2.0-0{a} libgnutls-dev{a} 
  libgpg-error-ce-arm-dev{a} libgpg-error-dev{a} libice6{a} libidn11-dev{a} 
  libkadm55{a} libkrb5-dev{a} libksba-ce-arm-dev{a} libldap2-dev{a} 
  libncurses5-dev{a} libpcre3{a} libpth-ce-arm-dev{a} libreadline5-dev{a} 
  libsm6{a} libtasn1-3-dev{a} libusb-dev{a} libxext6{a} libxt6{a} 
  pkg-config{a} zlib1g-dev{a} 
The following partially installed packages will be configured:
  pbuilder-satisfydepends-dummy 
0 packages upgraded, 29 newly installed, 0 to remove and 0 not upgraded.
Need to get 0B/8075kB of archives. After unpacking 24.5MB will be used.
WARNING: untrusted versions of the following packages will be installed!

Untrusted packages could compromise your system's security.
You should only proceed with the installation if you are certain that
this is what you want to do.

  libgpg-error-ce-arm-dev libgpg-error-dev libassuan-ce-arm-dev 
  libpth-ce-arm-dev libgcrypt-ce-arm-dev libksba-ce-arm-dev 

*** WARNING ***   Ignoring these trust violations because
                  aptitude::CmdLine::Ignore-Trust-Violations is 'true'!
Writing extended state information...
debconf: delaying package configuration, since apt-utils is not installed
Selecting previously deselected package zlib1g-dev.
(Reading database ... 15527 files and directories currently installed.)
Unpacking zlib1g-dev (from .../zlib1g-dev_1%3a1.2.3.3.dfsg-12_i386.deb) ...
Selecting previously deselected package libldap2-dev.
Unpacking libldap2-dev (from .../libldap2-dev_2.4.11-1_i386.deb) ...
Selecting previously deselected package libbz2-dev.
Unpacking libbz2-dev (from .../libbz2-dev_1.0.5-1_i386.deb) ...
Selecting previously deselected package libgpg-error-ce-arm-dev.
Unpacking libgpg-error-ce-arm-dev (from .../libgpg-error-ce-arm-dev_1.8-svn238-1_all.deb) ...
Selecting previously deselected package libassuan-ce-arm-dev.
Unpacking libassuan-ce-arm-dev (from .../libassuan-ce-arm-dev_2.0.1-svn368-1_all.deb) ...
Selecting previously deselected package libgcrypt-ce-arm-dev.
Unpacking libgcrypt-ce-arm-dev (from .../libgcrypt-ce-arm-dev_1.5.0-svn1427-1_all.deb) ...
Selecting previously deselected package libksba-ce-arm-dev.
Unpacking libksba-ce-arm-dev (from .../libksba-ce-arm-dev_1.0.8-svn315-1_all.deb) ...
Selecting previously deselected package libpth-ce-arm-dev.
Unpacking libpth-ce-arm-dev (from .../libpth-ce-arm-dev_2.0.3-svn35-1_all.deb) ...
Selecting previously deselected package libusb-dev.
Unpacking libusb-dev (from .../libusb-dev_2%3a0.1.12-13_i386.deb) ...
Selecting previously deselected package libice6.
Unpacking libice6 (from .../libice6_2%3a1.0.4-1_i386.deb) ...
Selecting previously deselected package libsm6.
Unpacking libsm6 (from .../libsm6_2%3a1.0.3-2_i386.deb) ...
Selecting previously deselected package libxext6.
Unpacking libxext6 (from .../libxext6_2%3a1.0.4-1_i386.deb) ...
Selecting previously deselected package libxt6.
Unpacking libxt6 (from .../libxt6_1%3a1.0.5-3_i386.deb) ...
Selecting previously deselected package ghostscript-x.
Unpacking ghostscript-x (from .../ghostscript-x_8.62.dfsg.1-3.2lenny1_i386.deb) ...
Selecting previously deselected package gs.
Unpacking gs (from .../gs_8.62.dfsg.1-3.2lenny1_all.deb) ...
Selecting previously deselected package libncurses5-dev.
Unpacking libncurses5-dev (from .../libncurses5-dev_5.7+20081213-1_i386.deb) ...
Selecting previously deselected package libreadline5-dev.
Unpacking libreadline5-dev (from .../libreadline5-dev_5.2-3.1_i386.deb) ...
Selecting previously deselected package libgpg-error-dev.
Unpacking libgpg-error-dev (from .../libgpg-error-dev_1.8+svn237-kk1_i386.deb) ...
Selecting previously deselected package libgcrypt11-dev.
Unpacking libgcrypt11-dev (from .../libgcrypt11-dev_1.4.1-1_i386.deb) ...
Selecting previously deselected package libtasn1-3-dev.
Unpacking libtasn1-3-dev (from .../libtasn1-3-dev_1.4-1_i386.deb) ...
Selecting previously deselected package libgnutls-dev.
Unpacking libgnutls-dev (from .../libgnutls-dev_2.4.2-6+lenny2_i386.deb) ...
Selecting previously deselected package libpcre3.
Unpacking libpcre3 (from .../libpcre3_7.6-2.1_i386.deb) ...
Selecting previously deselected package libglib2.0-0.
Unpacking libglib2.0-0 (from .../libglib2.0-0_2.16.6-3_i386.deb) ...
Selecting previously deselected package pkg-config.
Unpacking pkg-config (from .../pkg-config_0.22-1_i386.deb) ...
Selecting previously deselected package libidn11-dev.
Unpacking libidn11-dev (from .../libidn11-dev_1.8+20080606-1_i386.deb) ...
Selecting previously deselected package libkadm55.
Unpacking libkadm55 (from .../libkadm55_1.6.dfsg.4~beta1-5lenny2_i386.deb) ...
Selecting previously deselected package comerr-dev.
Unpacking comerr-dev (from .../comerr-dev_2.1-1.41.3-1_i386.deb) ...
Selecting previously deselected package libkrb5-dev.
Unpacking libkrb5-dev (from .../libkrb5-dev_1.6.dfsg.4~beta1-5lenny2_i386.deb) ...
Selecting previously deselected package libcurl4-gnutls-dev.
Unpacking libcurl4-gnutls-dev (from .../libcurl4-gnutls-dev_7.18.2-8lenny3_i386.deb) ...
Processing triggers for man-db ...
Setting up zlib1g-dev (1:1.2.3.3.dfsg-12) ...
Setting up libldap2-dev (2.4.11-1) ...
Setting up libbz2-dev (1.0.5-1) ...
Setting up libgpg-error-ce-arm-dev (1.8-svn238-1) ...
Setting up libassuan-ce-arm-dev (2.0.1-svn368-1) ...
Setting up libgcrypt-ce-arm-dev (1.5.0-svn1427-1) ...
Setting up libksba-ce-arm-dev (1.0.8-svn315-1) ...
Setting up libpth-ce-arm-dev (2.0.3-svn35-1) ...
Setting up libusb-dev (2:0.1.12-13) ...
Setting up libice6 (2:1.0.4-1) ...
Setting up libsm6 (2:1.0.3-2) ...
Setting up libxext6 (2:1.0.4-1) ...
Setting up libxt6 (1:1.0.5-3) ...
Setting up ghostscript-x (8.62.dfsg.1-3.2lenny1) ...
Setting up gs (8.62.dfsg.1-3.2lenny1) ...
Setting up libncurses5-dev (5.7+20081213-1) ...
Setting up libreadline5-dev (5.2-3.1) ...
Setting up libgpg-error-dev (1.8+svn237-kk1) ...
Setting up libgcrypt11-dev (1.4.1-1) ...
Setting up libtasn1-3-dev (1.4-1) ...
Setting up libgnutls-dev (2.4.2-6+lenny2) ...
Setting up libpcre3 (7.6-2.1) ...
Setting up libglib2.0-0 (2.16.6-3) ...
Setting up pkg-config (0.22-1) ...
Setting up libidn11-dev (1.8+20080606-1) ...
Setting up libkadm55 (1.6.dfsg.4~beta1-5lenny2) ...
Setting up comerr-dev (2.1-1.41.3-1) ...
Setting up libkrb5-dev (1.6.dfsg.4~beta1-5lenny2) ...
Setting up libcurl4-gnutls-dev (7.18.2-8lenny3) ...
Setting up pbuilder-satisfydepends-dummy (0.invalid.0) ...
Reading package lists...
Building dependency tree...
Reading state information...
Reading extended state information...
Initializing package states...
Writing extended state information...
 -> Finished parsing the build-deps
Reading package lists...
Building dependency tree...
Reading state information...
fakeroot is already the newest version.
0 upgraded, 0 newly installed, 0 to remove and 0 not upgraded.
Copying back the cached apt archive contents
Copying source file
    -> copying [/home/builder/wince-packager/mill/tracks/gnupg2-ce-arm/pkg/5305-0/src/gnupg2-ce-arm_2.1.0-svn5305-1.dsc]
    -> copying [/home/builder/wince-packager/mill/tracks/gnupg2-ce-arm/pkg/5305-0/src/gnupg2-ce-arm_2.1.0-svn5305.orig.tar.gz]
    -> copying [/home/builder/wince-packager/mill/tracks/gnupg2-ce-arm/pkg/5305-0/src/gnupg2-ce-arm_2.1.0-svn5305-1.diff.gz]
Extracting source
dpkg-source: warning: extracting unsigned source package (gnupg2-ce-arm_2.1.0-svn5305-1.dsc)
dpkg-source: extracting gnupg2-ce-arm in gnupg2-ce-arm-2.1.0-svn5305
dpkg-source: info: unpacking gnupg2-ce-arm_2.1.0-svn5305.orig.tar.gz
dpkg-source: info: applying gnupg2-ce-arm_2.1.0-svn5305-1.diff.gz
 -> Building the package
dpkg-buildpackage: set CFLAGS to default value: -g -O2
dpkg-buildpackage: set CPPFLAGS to default value: 
dpkg-buildpackage: set LDFLAGS to default value: 
dpkg-buildpackage: set FFLAGS to default value: -g -O2
dpkg-buildpackage: set CXXFLAGS to default value: -g -O2
dpkg-buildpackage: source package gnupg2-ce-arm
dpkg-buildpackage: source version 2.1.0-svn5305-1
dpkg-buildpackage: source changed by Andre Heinecke <aheinecke@intevation.de>
dpkg-buildpackage: host architecture i386
 fakeroot debian/rules clean
dh_testdir
dh_testroot
rm -f build-stamp configure-stamp
dh_clean
	rm -f debian/gnupg-agent-ce-arm.substvars
	rm -f debian/gnupg-agent-ce-arm.*.debhelper
	rm -f debian/gnupg-agent-ce-arm.debhelper.log
	rm -rf debian/gnupg-agent-ce-arm/
	rm -f debian/gpgsm-ce-arm.substvars
	rm -f debian/gpgsm-ce-arm.*.debhelper
	rm -f debian/gpgsm-ce-arm.debhelper.log
	rm -rf debian/gpgsm-ce-arm/
	rm -f debian/gnupg2.substvars
	rm -f debian/gnupg2.*.debhelper
	rm -f debian/gnupg2.debhelper.log
	rm -rf debian/gnupg2/
	rm -f debian/files
	find .  \( \( -type f -a \
	        \( -name '#*#' -o -name '.*~' -o -name '*~' -o -name DEADJOE \
		 -o -name '*.orig' -o -name '*.rej' -o -name '*.bak' \
		 -o -name '.*.orig' -o -name .*.rej -o -name '.SUMS' \
		 -o -name TAGS -o \( -path '*/.deps/*' -a -name '*.P' \) \
		\) -exec rm -f {} \; \) -o \
		\( -type d -a -name autom4te.cache -prune -exec rm -rf {} \; \) \)
 debian/rules build
dh_testdir
chmod +x configure
./configure --host=arm-mingw32ce --enable-maintainer-mode \
	        --prefix=/opt/mingw32ce --mandir=\${prefix}/share/man --infodir=\${prefix}/share/info
configure: WARNING: If you wanted to set the --build type, don't use --host.
    If a cross compiler is detected then cross compile mode will be used.
checking for a BSD-compatible install... /usr/bin/install -c
checking whether build environment is sane... yes
checking for a thread-safe mkdir -p... /bin/mkdir -p
checking for gawk... gawk
checking whether make sets $(MAKE)... yes
checking for arm-mingw32ce-strip... arm-mingw32ce-strip
checking build system type... x86_64-unknown-linux-gnu
checking host system type... arm-unknown-mingw32ce
configure: autobuild project... gnupg
configure: autobuild revision... 2.1.0-svn5305
configure: autobuild hostname... autonoe
configure: autobuild timestamp... 20100414-101107
checking whether SELinux support is requested... no
checking whether to enable the BZIP2 compression algorithm... yes
checking whether to enable external program execution... yes
checking whether to enable photo ID viewing... yes
checking whether to use a fixed photo ID viewer... no
checking whether to enable external keyserver helpers... yes
checking whether LDAP keyserver support is requested... yes
checking whether HKP keyserver support is requested... yes
checking whether finger key fetching support is requested... yes
checking whether generic object key fetching support is requested... yes
checking whether email keyserver support is requested... no
checking whether keyserver exec-path is enabled... yes
checking for the size of the key and uid cache... 4096
checking whether use of capabilities is requested... no
checking whether to enable the internal CCID driver... yes
checking whether to enable maintainer-specific portions of Makefiles... yes
configure: checking for programs
checking whether make sets $(MAKE)... (cached) yes
checking whether build environment is sane... yes
checking for gawk... (cached) gawk
checking for arm-mingw32ce-gcc... arm-mingw32ce-gcc
checking for C compiler default output file name... a.exe
checking whether the C compiler works... yes
checking whether we are cross compiling... yes
checking for suffix of executables... .exe
checking for suffix of object files... o
checking whether we are using the GNU C compiler... yes
checking whether arm-mingw32ce-gcc accepts -g... yes
checking for arm-mingw32ce-gcc option to accept ISO C89... none needed
checking for style of include used by make... GNU
checking dependency style of arm-mingw32ce-gcc... gcc3
checking how to run the C preprocessor... arm-mingw32ce-gcc -E
checking whether arm-mingw32ce-gcc and cc understand -c and -o together... yes
checking for a BSD-compatible install... /usr/bin/install -c
checking whether ln -s works... yes
checking for arm-mingw32ce-ranlib... arm-mingw32ce-ranlib
checking for arm-mingw32ce-ar... arm-mingw32ce-ar
checking for perl... /usr/bin/perl
checking for arm-mingw32ce-windres... arm-mingw32ce-windres
checking for strerror in -lcposix... no
checking for special C compiler options needed for large files... no
checking for _FILE_OFFSET_BITS value needed for large files... unknown
checking for _LARGE_FILES value needed for large files... unknown
checking for faqprog.pl... no
checking for tar... /bin/tar
checking whether /bin/tar speaks USTAR... yes
checking for cc for build... cc
configure: checking for libraries
checking for gpg-error-config... /usr/bin/gpg-error-config
checking for GPG Error - version >= 1.4... yes (1.8-svn237)
checking for libgcrypt-config... /usr/bin/libgcrypt-config
checking for LIBGCRYPT - version >= 1.4.0... yes (1.4.1)
checking LIBGCRYPT API version... okay
checking for libassuan-config... /opt/mingw32ce/bin/libassuan-config
checking for LIBASSUAN - version >= 2.0.0... yes (2.0.1-svn368)
checking LIBASSUAN API version... okay
checking for ksba-config... /opt/mingw32ce/bin/ksba-config
checking for KSBA - version >= 1.0.2... yes (1.0.8-svn315)
checking KSBA API version... okay
checking for usb_bulk_write in -lusb... no
checking for usb_create_match... no
checking for library containing dlopen... no
checking for encfs... /usr/bin/encfs
checking for fusermount... /usr/bin/fusermount
checking for openpty in -lutil... no
checking for shred... /usr/bin/shred
checking for pth-config... /opt/mingw32ce/bin/pth-config
checking for PTH - version >= 1.3.7... yes
checking whether PTH installation is sane... yes
configure: checking for networking options
checking for gethostbyname... no
checking for gethostbyname in -lnsl... no
checking for setsockopt... no
checking for setsockopt in -lsocket... no
checking for grep that handles long lines and -e... /bin/grep
checking for egrep... /bin/grep -E
checking for ANSI C header files... yes
checking for sys/types.h... yes
checking for sys/stat.h... yes
checking for stdlib.h... yes
checking for string.h... yes
checking for memory.h... yes
checking for strings.h... yes
checking for inttypes.h... yes
checking for stdint.h... yes
checking for unistd.h... yes
checking adns.h usability... no
checking adns.h presence... no
checking for adns.h... no
checking for adns_free... no
checking for library containing res_query... no
checking for library containing __res_query... no
checking for library containing dn_expand... no
checking for library containing __dn_expand... no
checking for library containing dn_skipname... no
checking for library containing __dn_skipname... no
checking whether LDAP via "-lldap" is present and sane... no
checking whether I can make LDAP be sane with lber.h... no
checking whether LDAP via "-lldap -llber" is present and sane... no
checking whether I can make LDAP be sane with lber.h... no
checking whether LDAP via "-lldap -llber -lresolv" is present and sane... no
checking whether I can make LDAP be sane with lber.h... no
checking whether LDAP via "-lwldap32" is present and sane... no
checking whether I can make LDAP be sane with lber.h... no
checking for gawk... (cached) gawk
checking for curl-config... /usr/bin/curl-config
checking for the version of libcurl... 7.18.2
checking for libcurl >= version 7.10... yes
checking whether libcurl is usable... no
checking for ld used by GCC... /opt/mingw32ce/arm-mingw32ce/bin/ld
checking if the linker (/opt/mingw32ce/arm-mingw32ce/bin/ld) is GNU ld... yes
checking for shared library run path origin... done
checking for iconv... no, consider installing GNU libiconv
configure: checking for gettext
checking whether NLS is requested... yes
checking for msgfmt... /usr/bin/msgfmt
checking for gmsgfmt... /usr/bin/msgfmt
checking for xgettext... /usr/bin/xgettext
checking for msgmerge... /usr/bin/msgmerge
checking for nl_langinfo and CODESET... no
checking for LC_MESSAGES... no
configure: checking for header files
checking for ANSI C header files... (cached) yes
checking for string.h... (cached) yes
checking for unistd.h... (cached) yes
checking langinfo.h usability... no
checking langinfo.h presence... no
checking for langinfo.h... no
checking termio.h usability... no
checking termio.h presence... no
checking for termio.h... no
checking locale.h usability... no
checking locale.h presence... no
checking for locale.h... no
checking getopt.h usability... yes
checking getopt.h presence... yes
checking for getopt.h... yes
checking pty.h usability... no
checking pty.h presence... no
checking for pty.h... no
checking pwd.h usability... no
checking pwd.h presence... no
checking for pwd.h... no
checking for inttypes.h... (cached) yes
checking signal.h usability... no
checking signal.h presence... no
checking for signal.h... no
checking whether time.h and sys/time.h may both be included... yes
configure: checking for system characteristics
checking for an ANSI C-conforming const... yes
checking for inline... inline
checking for working volatile... yes
checking for size_t... yes
checking for mode_t... yes
checking return type of signal handlers... void
checking whether sys_siglist is declared... no
checking sys/socket.h usability... no
checking sys/socket.h presence... no
checking for sys/socket.h... no
checking sys/time.h usability... yes
checking sys/time.h presence... yes
checking for sys/time.h... yes
checking for unistd.h... (cached) yes
checking wchar.h usability... yes
checking wchar.h presence... yes
checking for wchar.h... yes
checking for stdint.h... (cached) yes
checking winsock2.h usability... yes
checking winsock2.h presence... yes
checking for winsock2.h... yes
checking ws2tcpip.h usability... yes
checking ws2tcpip.h presence... yes
checking for ws2tcpip.h... yes
checking for socklen_t... yes
checking endianess... little
checking for byte typedef... no
checking for ushort typedef... no
checking for ulong typedef... no
checking for u16 typedef... no
checking for u32 typedef... no
checking for unsigned short... yes
checking size of unsigned short... 2
checking for unsigned int... yes
checking size of unsigned int... 4
checking for unsigned long... yes
checking size of unsigned long... 4
checking for unsigned long long... yes
checking size of unsigned long long... 8
checking for time_t... yes
checking size of time_t... 4
checking for UINT64_C... yes
checking for uint64_t... yes
checking size of uint64_t... 8
configure: checking for library functions
checking whether getpagesize is declared... no
checking for _LARGEFILE_SOURCE value needed for large files... unknown
checking for vprintf... yes
checking for _doprnt... no
checking for pid_t... yes
checking vfork.h usability... no
checking vfork.h presence... no
checking for vfork.h... no
checking for fork... no
checking for vfork... no
checking for strerror... no
checking for strlwr... yes
checking for tcgetattr... no
checking for mmap... no
checking for strcasecmp... yes
checking for strncasecmp... yes
checking for ctermid... no
checking for times... no
checking for gmtime_r... no
checking for unsetenv... no
checking for fcntl... no
checking for ftruncate... yes
checking for gettimeofday... yes
checking for getrusage... no
checking for getrlimit... no
checking for setrlimit... no
checking for clock_gettime... no
checking for atexit... yes
checking for raise... no
checking for getpagesize... no
checking for strftime... yes
checking for nl_langinfo... no
checking for setlocale... no
checking for waitpid... no
checking for wait4... no
checking for sigaction... no
checking for sigprocmask... no
checking for pipe... no
checking for stat... yes
checking for getaddrinfo... no
checking for ttyname... no
checking for rand... yes
checking for ftello... no
checking for fsync... no
checking for struct sigaction... no
checking for sigset_t... no
checking for signal.h... (cached) no
checking for memicmp... yes
checking for stpcpy... no
checking for strsep... no
checking for strlwr... (cached) yes
checking for strtoul... yes
checking for memmove... yes
checking for stricmp... yes
checking for strtol... yes
checking for memrchr... no
checking for isascii... yes
checking for timegm... no
checking for getrusage... (cached) no
checking for setrlimit... (cached) no
checking for stat... (cached) yes
checking for setlocale... (cached) no
checking for flockfile... no
checking for funlockfile... no
checking for fopencookie... no
checking for funopen... no
checking for getpwnam... no
checking for getpwuid... no
checking for getenv... no
checking for working alloca.h... no
checking for alloca... yes
checking for stdlib.h... (cached) yes
checking for GNU libc compatible malloc... no
checking for long long int... yes
checking for long double... yes
checking whether stat file-mode macros are broken... no
checking for unsigned long long int... yes
checking for mkdtemp... no
checking time.h usability... yes
checking time.h presence... yes
checking for time.h... yes
checking for gettimeofday... (cached) yes
checking for setenv... no
checking for unsetenv... (cached) no
checking search.h usability... yes
checking search.h presence... yes
checking for search.h... yes
checking for tsearch... yes
checking if environ is properly declared... no
checking if environ is properly declared... (cached) no
checking for stdint.h... (cached) yes
checking for SIZE_MAX... yes
checking absolute name of <stdint.h>... ///opt/mingw32ce/lib/gcc/arm-mingw32ce/4.4.0/../../../../arm-mingw32ce/include/stdint.h
checking whether stdint.h conforms to C99... yes
checking for strpbrk... yes
checking for unistd.h... (cached) yes
checking for stdint.h... (cached) yes
checking for sys/stat.h... (cached) yes
checking for unistd.h... (cached) yes
checking direct.h usability... no
checking direct.h presence... no
checking for direct.h... no
checking if mkdir takes one argument... yes
checking whether regular expression support is requested... yes
checking for library containing regcomp... no
checking for regcomp... no
checking zlib.h usability... no
checking zlib.h presence... no
checking for zlib.h... no
checking for bzlib.h... no
checking whether readline via "-lreadline" is present and sane... no
checking whether readline via "-lreadline -ltermcap" is present and sane... no
checking whether readline via "-lreadline -lcurses" is present and sane... no
checking whether readline via "-lreadline -lncurses" is present and sane... no
configure: checking for cc features
checking if gcc supports -Wno-missing-field-initializers... yes
checking if gcc supports -Wdeclaration-after-statement... yes
checking if gcc supports -Wno-pointer-sign... yes
checking if gcc supports -Wpointer-arith... yes
configure: checking system features for estream-printf
checking for stdint.h... (cached) yes
checking for long long int... (cached) yes
checking for long double... yes
checking for intmax_t... yes
checking for uintmax_t... yes
checking for ptrdiff_t... yes
checking for unsigned long... (cached) yes
checking size of unsigned long... (cached) 4
checking for void *... yes
checking size of void *... 4
checking for nl_langinfo and THOUSANDS_SEP... no
configure: checking system features for estream
configure: creating ./config.status
config.status: creating m4/Makefile
config.status: creating Makefile
config.status: creating po/Makefile.in
config.status: creating gl/Makefile
config.status: creating include/Makefile
config.status: creating common/Makefile
config.status: creating kbx/Makefile
config.status: creating g10/Makefile
config.status: creating sm/Makefile
config.status: creating agent/Makefile
config.status: creating scd/Makefile
config.status: creating g13/Makefile
config.status: creating keyserver/Makefile
config.status: creating keyserver/gpg2keys_mailto
config.status: creating keyserver/gpg2keys_test
config.status: creating tools/gpg-zip
config.status: creating tools/Makefile
config.status: creating doc/Makefile
config.status: creating tests/Makefile
config.status: creating tests/openpgp/Makefile
config.status: creating tests/pkits/Makefile
config.status: creating config.h
config.status: executing depfiles commands
config.status: executing po-directories commands
config.status: creating po/POTFILES
config.status: creating po/Makefile

        GnuPG v2.1.0-svn5305 has been configured as follows:

        Platform:  W32CE (arm-unknown-mingw32ce)

        OpenPGP:   yes
        S/MIME:    yes
        Agent:     yes 
        Smartcard: yes (without internal CCID driver)
        G13:       yes


        Protect tool:      (default)
        Default agent:     (default)
        Default pinentry:  (default)
        Default scdaemon:  (default)
        Default dirmngr:   (default)


        Warning: No regular expression support available.
                 OpenPGP trust signatures won't work.
                 gpg-check-pattern will not be build.

touch configure-stamp
dh_testdir
/usr/bin/make
make[1]: Entering directory `/tmp/buildd/gnupg2-ce-arm-2.1.0-svn5305'
/usr/bin/make  all-recursive
make[2]: Entering directory `/tmp/buildd/gnupg2-ce-arm-2.1.0-svn5305'
Making all in m4
make[3]: Entering directory `/tmp/buildd/gnupg2-ce-arm-2.1.0-svn5305/m4'
make[3]: Nothing to be done for `all'.
make[3]: Leaving directory `/tmp/buildd/gnupg2-ce-arm-2.1.0-svn5305/m4'
Making all in gl
make[3]: Entering directory `/tmp/buildd/gnupg2-ce-arm-2.1.0-svn5305/gl'
{ echo '/* DO NOT EDIT! GENERATED AUTOMATICALLY! */'; \
	  cat ./alloca_.h; \
	} > alloca.h-t
mv -f alloca.h-t alloca.h
/usr/bin/make  all-am
make[4]: Entering directory `/tmp/buildd/gnupg2-ce-arm-2.1.0-svn5305/gl'
arm-mingw32ce-gcc -DHAVE_CONFIG_H -I. -I..   -I/opt/mingw32ce/include  -I/opt/mingw32ce/include -O3 -Wall -Wcast-align -Wshadow -Wstrict-prototypes -Wformat -Wno-format-y2k -Wformat-security -W -Wno-sign-compare -Wno-missing-field-initializers -Wdeclaration-after-statement -Wno-pointer-sign -Wpointer-arith -MT allocsa.o -MD -MP -MF .deps/allocsa.Tpo -c -o allocsa.o allocsa.c
allocsa.c: In function 'mallocsa':
allocsa.c:82: warning: cast increases required alignment of target type
allocsa.c:86: warning: cast increases required alignment of target type
allocsa.c: In function 'freesa':
allocsa.c:126: warning: cast increases required alignment of target type
allocsa.c:130: warning: cast increases required alignment of target type
mv -f .deps/allocsa.Tpo .deps/allocsa.Po
arm-mingw32ce-gcc -DHAVE_CONFIG_H -I. -I..   -I/opt/mingw32ce/include  -I/opt/mingw32ce/include -O3 -Wall -Wcast-align -Wshadow -Wstrict-prototypes -Wformat -Wno-format-y2k -Wformat-security -W -Wno-sign-compare -Wno-missing-field-initializers -Wdeclaration-after-statement -Wno-pointer-sign -Wpointer-arith -MT mkdtemp.o -MD -MP -MF .deps/mkdtemp.Tpo -c -o mkdtemp.o mkdtemp.c
In file included from mkdtemp.c:24:
/opt/mingw32ce/lib/gcc/arm-mingw32ce/4.4.0/../../../../arm-mingw32ce/include/errno.h:12:25: error: no include path in which to search for errno.h
mkdtemp.c: In function 'gen_tempname':
mkdtemp.c:125: error: 'errno' undeclared (first use in this function)
mkdtemp.c:125: error: (Each undeclared identifier is reported only once
mkdtemp.c:125: error: for each function it appears in.)
mkdtemp.c:146: error: 'EINVAL' undeclared (first use in this function)
mkdtemp.c:197: error: 'EEXIST' undeclared (first use in this function)
make[4]: *** [mkdtemp.o] Error 1
make[4]: Leaving directory `/tmp/buildd/gnupg2-ce-arm-2.1.0-svn5305/gl'
make[3]: *** [all] Error 2
make[3]: Leaving directory `/tmp/buildd/gnupg2-ce-arm-2.1.0-svn5305/gl'
make[2]: *** [all-recursive] Error 1
make[2]: Leaving directory `/tmp/buildd/gnupg2-ce-arm-2.1.0-svn5305'
make[1]: *** [all] Error 2
make[1]: Leaving directory `/tmp/buildd/gnupg2-ce-arm-2.1.0-svn5305'
make: *** [build-stamp] Error 2
dpkg-buildpackage: failure: debian/rules build gave error exit status 2
pbuilder: Failed autobuilding of package
 -> Aborting with an error
 -> unmounting /home/builder/wince-packager/mill/pbuilder/extra-pkg filesystem
 -> unmounting dev/pts filesystem
 -> unmounting proc filesystem
 -> cleaning the build env 
    -> removing directory /home/builder/wince-packager/mill/pbuilder/build/18398 and its subdirectories